program: Orca
programVersion: 5.0.2
elementType: O O O C C C C C C C C C C C C C C C C C C C H H H H H H H H H H H H H H H H H H H H H H H H H H
charge: 0
multiplicity: 1
keywords: wb97x-d3
keywords: def2-TZVPP
keywords: def2/J RIJCOSX
keywords: DEFGRID2
keywords: scfconv7
keywords: smallprint printgap noloewdin
keywords: NOSOSCF
formula: C19H26O3
InChI: InChI=1/C19H26O3/c1-7-8-13-12(4)16(10-15(13)20)22-18(21)17-14(9-11(2)3)19(17,5)6/h7,9,14,16-17H,1,8,10H2,2-6H3
48 atoms
O  -0.31744 -0.126494 1.021401
O  0.211138 0.671512 3.034214
O  -3.8775 2.481511 -0.229539
C  2.547717 -1.361726 1.193637
C  2.451658 -0.249054 0.19179
C  1.964879 -0.021884 1.61037
C  3.888214 -1.703603 1.798007
C  1.663855 -2.570767 1.012981
C  3.626948 0.506634 -0.28826
C  0.552683 0.203635 1.968929
C  3.91082 0.73807 -1.573467
C  -1.710639 0.072269 1.288265
C  3.055115 0.231684 -2.703978
C  5.110192 1.542895 -1.970145
C  -2.1475 1.528202 1.179271
C  -2.465764 -0.645986 0.203708
C  -3.325879 0.164067 -0.432705
C  -3.214301 1.520454 0.110032
C  -2.228571 -2.084256 -0.05923
C  -4.242315 -0.193883 -1.550314
C  -3.574832 -0.312519 -2.890099
C  -2.284406 -0.145846 -3.153034
H  1.666088 -0.386648 -0.543636
H  2.625199 0.560637 2.243743
H  3.75518 -2.235664 2.741564
H  4.452052 -2.355425 1.127688
H  4.499029 -0.824661 1.999655
H  2.204762 -3.33307 0.449323
H  1.393105 -3.007199 1.976197
H  0.7467 -2.360495 0.468026
H  4.292801 0.909082 0.469266
H  -1.959657 -0.359824 2.261025
H  2.113019 0.779967 -2.77486
H  2.80325 -0.823282 -2.593972
H  3.561252 0.346868 -3.662048
H  5.670764 1.901896 -1.1072
H  4.818524 2.410515 -2.568238
H  5.788485 0.955536 -2.5945
H  -1.329322 2.181133 0.86723
H  -2.542544 1.927006 2.113574
H  -2.092043 -2.637157 0.870804
H  -3.047243 -2.535831 -0.617443
H  -1.317924 -2.219601 -0.647461
H  -5.046007 0.544487 -1.625135
H  -4.745652 -1.141789 -1.333697
H  -4.245449 -0.57116 -3.703357
H  -1.905024 -0.272138 -4.158554
H  -1.557808 0.107954 -2.390662
elementType: O C H
totalener: -965.41611338 hartree
nucrepener: 1837.89983526 hartree
electener: -2803.31594864 hartree
oneelecener: -4961.49904886 hartree
twoeener: 2158.18310022 hartree
cpcmener: -0.03924243 hartree
kineticenergy: 961.00175000 hartree
xcener: -95.142913203834 hartree
chargesum: -0.0000000
charge: -0.290736 -0.500373 -0.483943 0.105506 0.085615 -0.134091 -0.273477 -0.265125 -0.334769 0.433883 -0.006686 0.257501 -0.288508 -0.224915 -0.155236 -0.037001 -0.095470 0.333864 -0.313516 -0.071066 -0.185648 -0.281446 0.101533 0.089546 0.098072 0.097260 0.089066 0.097751 0.102146 0.075609 0.121925 0.111620 0.105671 0.102667 0.096443 0.086253 0.099166 0.095642 0.107471 0.106196 0.125848 0.120510 0.123333 0.087750 0.107817 0.134345 0.132977 0.109020
qa: -0.2907 -0.5004 -0.4839 0.1055 0.0856 -0.1341 -0.2735 -0.2651 -0.3348 0.4339 -0.0067 0.2575 -0.2885 -0.2249 -0.1552 -0.0370 -0.0955 0.3339 -0.3135 -0.0711 -0.1856 -0.2814 0.1015 0.0895 0.0981 0.0973 0.0891 0.0978 0.1021 0.0756 0.1219 0.1116 0.1057 0.1027 0.0964 0.0863 0.0992 0.0956 0.1075 0.1062 0.1258 0.1205 0.1233 0.0877 0.1078 0.1343 0.1330 0.1090
va: 2.1257 2.0004 2.0172 3.7020 3.7059 3.9204 3.9131 3.9199 3.8822 4.1157 3.6910 3.7290 3.9457 3.9229 3.9091 3.7257 3.4656 4.0214 3.9484 3.8273 3.8417 3.8952 1.0122 1.0347 1.0019 1.0013 1.0057 1.0021 1.0008 1.0091 1.0097 1.0168 0.9954 0.9959 1.0044 1.0098 0.9925 0.9934 1.0215 1.0227 1.0004 1.0003 0.9848 1.0237 1.0003 1.0014 1.0045 1.0204
dispcorr: -0.024062363 hartree
energy: -965.440175743290
dipole: 19.26869 -18.12907 1.13962 -11.82493 9.14568 -2.67925 -11.85361 10.99165 -0.86196
magnitude: 3.03646 au
magnitude: 7.71807 debye
