program: Orca
programVersion: 5.0.2
elementType: O O O C C C C C C C C C C C C C C C C C C C H H H H H H H H H H H H H H H H H H H H H H H H H H
charge: 0
multiplicity: 1
keywords: wb97x-d3
keywords: def2-TZVPP
keywords: def2/J RIJCOSX
keywords: DEFGRID2
keywords: scfconv7
keywords: smallprint printgap noloewdin
keywords: NOSOSCF
formula: C19H26O3
InChI: InChI=1/C19H26O3/c1-7-8-13-12(4)16(10-15(13)20)22-18(21)17-14(9-11(2)3)19(17,5)6/h7,9,14,16-17H,1,8,10H2,2-6H3
48 atoms
O  -0.284137 -0.069591 0.958448
O  0.176169 0.859411 2.932449
O  -4.150147 2.127878 -0.244192
C  2.663354 -1.049132 1.169539
C  2.495771 0.021745 0.134866
C  1.983059 0.263788 1.533535
C  4.027417 -1.262348 1.777243
C  1.868464 -2.324563 1.036891
C  3.64231 0.829135 -0.357254
C  0.556567 0.37927 1.886191
C  4.386324 0.516144 -1.421285
C  -1.686347 0.003132 1.243313
C  4.163187 -0.71336 -2.246615
C  5.516113 1.391631 -1.869786
C  -2.26387 1.407672 1.106886
C  -2.400197 -0.820973 0.204965
C  -3.372753 -0.123339 -0.402387
C  -3.375818 1.255071 0.096577
C  -2.026461 -2.237431 -0.021011
C  -4.316123 -0.568302 -1.471998
C  -3.753557 -0.246629 -2.826161
C  -4.263965 0.647435 -3.663342
H  1.730315 -0.194151 -0.604559
H  2.590983 0.916176 2.151851
H  3.943787 -1.755645 2.747222
H  4.632534 -1.902182 1.131391
H  4.572024 -0.330434 1.924405
H  1.57887 -2.715666 2.014136
H  0.968747 -2.209181 0.437349
H  2.482452 -3.084994 0.550818
H  3.88174 1.733379 0.195401
H  -1.874878 -0.4193 2.234365
H  3.926057 -0.448727 -3.280389
H  3.360277 -1.345408 -1.870447
H  5.072576 -1.317983 -2.28625
H  5.353685 1.750399 -2.889367
H  6.457768 0.837213 -1.884992
H  5.644426 2.259452 -1.223375
H  -1.525861 2.117938 0.726742
H  -2.64741 1.806887 2.045831
H  -2.79947 -2.78289 -0.559315
H  -1.108544 -2.303629 -0.609469
H  -1.83412 -2.746556 0.924474
H  -5.282061 -0.075986 -1.341163
H  -4.489647 -1.64385 -1.393083
H  -2.852303 -0.787358 -3.100442
H  -3.8070 0.844024 -4.624859
H  -5.157207 1.212005 -3.422369
elementType: O C H
totalener: -965.41637977 hartree
nucrepener: 1811.14374858 hartree
electener: -2776.56012835 hartree
oneelecener: -4908.13179643 hartree
twoeener: 2131.57166808 hartree
cpcmener: -0.03959532 hartree
kineticenergy: 961.00353858 hartree
xcener: -95.140579822171 hartree
chargesum: 0.0000000
charge: -0.289695 -0.499327 -0.483604 0.127856 0.027636 -0.122495 -0.277043 -0.297478 -0.285703 0.427946 -0.033739 0.246145 -0.251824 -0.231011 -0.145648 -0.022193 -0.073487 0.310173 -0.310886 -0.102677 -0.178412 -0.284414 0.105902 0.092657 0.101319 0.096803 0.092775 0.108375 0.083560 0.099001 0.122982 0.109312 0.102874 0.087703 0.096753 0.095847 0.094414 0.090303 0.107329 0.105947 0.115406 0.123459 0.121635 0.091327 0.113353 0.144589 0.132035 0.114221
qa: -0.2897 -0.4993 -0.4836 0.1279 0.0276 -0.1225 -0.2770 -0.2975 -0.2857 0.4279 -0.0337 0.2461 -0.2518 -0.2310 -0.1456 -0.0222 -0.0735 0.3102 -0.3109 -0.1027 -0.1784 -0.2844 0.1059 0.0927 0.1013 0.0968 0.0928 0.1084 0.0836 0.0990 0.1230 0.1093 0.1029 0.0877 0.0968 0.0958 0.0944 0.0903 0.1073 0.1059 0.1154 0.1235 0.1216 0.0913 0.1134 0.1446 0.1320 0.1142
va: 2.1235 2.0020 2.0102 3.6683 3.7619 3.9230 3.9083 3.9162 3.8471 4.1372 3.7076 3.7441 3.9392 3.9278 3.9106 3.7409 3.4649 4.0498 3.9512 3.8539 3.7831 3.9460 1.0176 1.0322 1.0024 1.0000 1.0028 0.9996 1.0066 1.0021 1.0071 1.0161 0.9985 1.0075 0.9978 0.9952 0.9964 1.0071 1.0222 1.0229 1.0053 0.9882 0.9981 1.0231 1.0074 1.0002 1.0025 1.0127
dispcorr: -0.023730456 hartree
energy: -965.440110227543
dipole: 21.26016 -19.49753 1.76262 -11.95842 9.22646 -2.73196 -10.97706 10.20569 -0.77137
magnitude: 3.34148 au
magnitude: 8.49337 debye
