program: Orca
programVersion: 5.0.2
elementType: O O O C C C C C C C C C C C C C C C C C C C H H H H H H H H H H H H H H H H H H H H H H H H H H
charge: 0
multiplicity: 1
keywords: wb97x-d3
keywords: def2-TZVPP
keywords: def2/J RIJCOSX
keywords: DEFGRID2
keywords: scfconv7
keywords: smallprint printgap noloewdin
keywords: NOSOSCF
formula: C19H26O3
InChI: InChI=1/C19H26O3/c1-7-8-13-12(4)16(10-15(13)20)22-18(21)17-14(9-11(2)3)19(17,5)6/h7,9,14,16-17H,1,8,10H2,2-6H3
48 atoms
O  -0.454209 0.320473 1.74725
O  -0.256019 0.3687 -0.481021
O  -4.074826 2.482539 -0.356211
C  2.384638 -1.212441 0.262748
C  2.698471 0.179955 -0.189083
C  1.667002 -0.024072 0.890687
C  3.374464 -1.920786 1.152818
C  1.657552 -2.141534 -0.67636
C  3.979055 0.849357 0.153825
C  0.245802 0.241398 0.612501
C  5.064537 0.84747 -0.623591
C  -1.861688 0.563686 1.694094
C  5.129265 0.143542 -1.943985
C  6.316657 1.561665 -0.216126
C  -2.281797 1.938765 1.185203
C  -2.625733 -0.419737 0.847344
C  -3.538432 0.194323 0.076914
C  -3.40063 1.644331 0.213577
C  -2.375224 -1.877976 0.947031
C  -4.505769 -0.454398 -0.862017
C  -3.814238 -0.883095 -2.122786
C  -3.705163 -2.142422 -2.527749
H  2.284364 0.432977 -1.161321
H  1.975507 0.202978 1.905557
H  2.887428 -2.723531 1.709133
H  4.16894 -2.36808 0.551585
H  3.842334 -1.251678 1.87408
H  1.033818 -1.621016 -1.400016
H  2.384104 -2.730474 -1.239497
H  1.026134 -2.842307 -0.125861
H  4.023043 1.371212 1.105515
H  -2.168588 0.431808 2.733726
H  5.326317 0.851605 -2.753069
H  4.21727 -0.39928 -2.187672
H  5.955394 -0.571787 -1.955266
H  6.21228 2.053831 0.750543
H  6.594048 2.319282 -0.953406
H  7.159757 0.868922 -0.154823
H  -1.477946 2.472791 0.676144
H  -2.636961 2.58856 1.985724
H  -3.286325 -2.453733 0.784758
H  -1.658302 -2.192589 0.183049
H  -1.958161 -2.151655 1.915796
H  -5.305411 0.251533 -1.101273
H  -4.974755 -1.317937 -0.385085
H  -3.367524 -0.089055 -2.714077
H  -3.185497 -2.398231 -3.442299
H  -4.13463 -2.962803 -1.9641
elementType: O C H
totalener: -965.41461264 hartree
nucrepener: 1829.22319171 hartree
electener: -2794.63780435 hartree
oneelecener: -4945.27226789 hartree
twoeener: 2150.63446354 hartree
cpcmener: -0.03769580 hartree
kineticenergy: 961.00944386 hartree
xcener: -95.144039474220 hartree
chargesum: -0.0000000
charge: -0.300283 -0.491511 -0.494096 0.139982 -0.017454 -0.117503 -0.275942 -0.308433 -0.259732 0.414529 -0.041245 0.288614 -0.249373 -0.230365 -0.152594 0.005322 -0.128144 0.309446 -0.288955 -0.097790 -0.180332 -0.291937 0.102238 0.093024 0.100299 0.097940 0.093682 0.094952 0.102259 0.101397 0.123333 0.120916 0.102425 0.087558 0.096795 0.089924 0.095417 0.094452 0.112342 0.110895 0.118421 0.116025 0.120794 0.092505 0.106831 0.144962 0.132496 0.115915
qa: -0.3003 -0.4915 -0.4941 0.1400 -0.0175 -0.1175 -0.2759 -0.3084 -0.2597 0.4145 -0.0412 0.2886 -0.2494 -0.2304 -0.1526 0.0053 -0.1281 0.3094 -0.2890 -0.0978 -0.1803 -0.2919 0.1022 0.0930 0.1003 0.0979 0.0937 0.0950 0.1023 0.1014 0.1233 0.1209 0.1024 0.0876 0.0968 0.0899 0.0954 0.0945 0.1123 0.1109 0.1184 0.1160 0.1208 0.0925 0.1068 0.1450 0.1325 0.1159
va: 2.1335 2.0147 2.0006 3.6533 3.8058 3.8727 3.9054 3.9001 3.8531 4.1705 3.7071 3.7629 3.9368 3.9278 3.8737 3.6492 3.4796 4.0384 3.9385 3.8619 3.7835 3.9380 1.0238 1.0373 1.0029 1.0006 1.0023 1.0160 1.0026 0.9991 1.0061 0.9914 0.9985 1.0079 0.9977 1.0072 0.9951 0.9963 1.0251 1.0216 0.9977 0.9922 1.0074 1.0261 1.0082 1.0014 1.0030 1.0090
dispcorr: -0.024464843 hartree
energy: -965.439077484956
dipole: 23.20026 -21.38211 1.81814 -13.41732 11.39167 -2.02565 -4.66508 6.44109 1.77601
magnitude: 3.25010 au
magnitude: 8.26110 debye
