program: Orca
programVersion: 5.0.2
elementType: O O O C C C C C C C C C C C C C C C C C C C H H H H H H H H H H H H H H H H H H H H H H H H H H
charge: 0
multiplicity: 1
keywords: wb97x-d3
keywords: def2-TZVPP
keywords: def2/J RIJCOSX
keywords: DEFGRID2
keywords: scfconv7
keywords: smallprint printgap noloewdin
keywords: NOSOSCF
formula: C19H26O3
InChI: InChI=1/C19H26O3/c1-7-8-13-12(4)16(10-15(13)20)22-18(21)17-14(9-11(2)3)19(17,5)6/h7,9,14,16-17H,1,8,10H2,2-6H3
48 atoms
O  -0.404422 0.078298 0.984344
O  0.476549 -1.972987 1.195022
O  -4.808555 1.420327 0.872412
C  3.039878 -0.328983 2.018567
C  3.157273 -0.780994 0.60605
C  1.89926 -0.053493 1.046395
C  3.797322 0.899088 2.462377
C  2.893224 -1.362624 3.107219
C  4.082881 -0.142748 -0.365202
C  0.619509 -0.775307 1.091204
C  3.835707 0.007808 -1.669015
C  -1.746412 -0.416361 0.963588
C  2.557663 -0.423236 -2.319954
C  4.83775 0.639294 -2.585861
C  -2.676648 0.569736 1.654166
C  -2.258544 -0.505967 -0.451792
C  -3.43153 0.131296 -0.597548
C  -3.789287 0.792433 0.659809
C  -1.507904 -1.24371 -1.493957
C  -4.274238 0.222571 -1.822846
C  -3.82008 1.244944 -2.823544
C  -2.729469 1.998014 -2.749828
H  3.009225 -1.849816 0.468202
H  1.81624 0.980679 0.733271
H  4.822025 0.641714 2.737921
H  3.842398 1.665158 1.688259
H  3.322282 1.34318 3.338924
H  3.878958 -1.607811 3.507204
H  2.289868 -0.983561 3.933976
H  2.446798 -2.291307 2.759677
H  5.038281 0.199201 0.02312
H  -1.78994 -1.399769 1.436297
H  2.006781 0.442612 -2.69745
H  1.897564 -0.974423 -1.652729
H  2.762192 -1.057117 -3.186138
H  4.407983 1.502658 -3.100257
H  5.150288 -0.059506 -3.365798
H  5.729042 0.971785 -2.054306
H  -2.175852 1.521638 1.845905
H  -3.063881 0.206532 2.606081
H  -1.233178 -2.241524 -1.148986
H  -2.077199 -1.340647 -2.416259
H  -0.57608 -0.724733 -1.733347
H  -5.307507 0.44548 -1.541928
H  -4.319208 -0.750337 -2.322164
H  -4.466951 1.342884 -3.689674
H  -2.489071 2.701234 -3.536449
H  -2.042802 1.955003 -1.912869
elementType: O C H
totalener: -965.41721858 hartree
nucrepener: 1827.12055218 hartree
electener: -2792.53777076 hartree
oneelecener: -4940.21121463 hartree
twoeener: 2147.67344387 hartree
cpcmener: -0.03470273 hartree
kineticenergy: 961.00408869 hartree
xcener: -95.143783713987 hartree
chargesum: 0.0000000
charge: -0.295863 -0.500198 -0.485568 0.155746 -0.011350 -0.111465 -0.288757 -0.282622 -0.305054 0.396233 -0.008550 0.275444 -0.234374 -0.230450 -0.147410 -0.041279 -0.094742 0.326959 -0.265582 -0.070786 -0.188980 -0.282300 0.103729 0.093291 0.099609 0.093869 0.097914 0.096647 0.101260 0.091084 0.123782 0.107139 0.103679 0.069223 0.101996 0.094863 0.097162 0.090335 0.103049 0.101439 0.122578 0.109375 0.117346 0.088391 0.105559 0.133887 0.132908 0.110835
qa: -0.2959 -0.5002 -0.4856 0.1557 -0.0114 -0.1115 -0.2888 -0.2826 -0.3051 0.3962 -0.0085 0.2754 -0.2344 -0.2304 -0.1474 -0.0413 -0.0947 0.3270 -0.2656 -0.0708 -0.1890 -0.2823 0.1037 0.0933 0.0996 0.0939 0.0979 0.0966 0.1013 0.0911 0.1238 0.1071 0.1037 0.0692 0.1020 0.0949 0.0972 0.0903 0.1030 0.1014 0.1226 0.1094 0.1173 0.0884 0.1056 0.1339 0.1329 0.1108
va: 2.1233 1.9953 2.0128 3.6882 3.8081 3.8203 3.9107 3.8934 3.8952 4.1455 3.7025 3.7245 3.9373 3.9309 3.9157 3.7086 3.4515 4.0147 3.9279 3.8340 3.8357 3.8986 1.0261 1.0329 0.9995 1.0016 1.0027 1.0007 0.9989 1.0180 1.0031 1.0301 0.9966 1.0130 1.0007 0.9963 0.9959 1.0060 1.0280 1.0240 1.0085 1.0048 0.9925 1.0228 0.9996 1.0019 1.0042 1.0186
dispcorr: -0.024150693 hartree
energy: -965.441369272367
dipole: 21.29935 -19.44950 1.84985 0.69600 -1.00986 -0.31386 -8.67633 7.77531 -0.90103
magnitude: 2.08142 au
magnitude: 5.29054 debye
