program: Orca
programVersion: 5.0.2
elementType: O O O C C C C C C C C C C C C C C C C C C C H H H H H H H H H H H H H H H H H H H H H H H H H H
charge: 0
multiplicity: 1
keywords: wb97x-d3
keywords: def2-TZVPP
keywords: def2/J RIJCOSX
keywords: DEFGRID2
keywords: scfconv7
keywords: smallprint printgap noloewdin
keywords: NOSOSCF
formula: C19H26O3
InChI: InChI=1/C19H26O3/c1-7-8-13-12(4)16(10-15(13)20)22-18(21)17-14(9-11(2)3)19(17,5)6/h7,9,14,16-17H,1,8,10H2,2-6H3
48 atoms
O  -0.334021 0.129682 1.530373
O  0.109495 0.22983 -0.660765
O  -3.745877 2.53252 -0.6932
C  2.579789 -1.482364 0.384976
C  3.004769 -0.122632 -0.083148
C  1.85994 -0.246735 0.902355
C  3.409366 -2.228474 1.401366
C  1.903397 -2.400927 -0.602677
C  4.260701 0.517608 0.351223
C  0.485462 0.065608 0.477436
C  5.061943 1.288889 -0.391768
C  -1.723456 0.392364 1.328873
C  4.823245 1.649876 -1.826424
C  6.310216 1.878649 0.19314
C  -2.065998 1.8158 0.903863
C  -2.391523 -0.491814 0.307297
C  -3.211395 0.211598 -0.491722
C  -3.106227 1.634734 -0.175772
C  -2.211909 -1.963874 0.31303
C  -4.134061 -0.337465 -1.533682
C  -5.382332 -0.884589 -0.906631
C  -5.73812 -2.16316 -0.932683
H  2.687207 0.108209 -1.094105
H  2.077888 0.000495 1.935474
H  3.833967 -1.579045 2.165317
H  2.798028 -2.975695 1.910384
H  4.232549 -2.753346 0.912627
H  1.376343 -1.871952 -1.394069
H  2.651836 -3.0360 -1.080166
H  1.190227 -3.057806 -0.100055
H  4.550926 0.346592 1.383765
H  -2.156904 0.173597 2.307399
H  4.707517 2.731316 -1.932825
H  3.944937 1.1782 -2.261439
H  5.685376 1.372969 -2.437712
H  6.293467 2.970042 0.133101
H  7.1941 1.554565 -0.362283
H  6.447905 1.600767 1.237833
H  -1.207089 2.354136 0.497999
H  -2.460086 2.416229 1.724167
H  -2.273993 -2.378442 -0.692592
H  -1.263523 -2.267592 0.75469
H  -3.005013 -2.430721 0.903544
H  -3.632172 -1.122514 -2.104083
H  -4.393118 0.45502 -2.240531
H  -6.008419 -0.165222 -0.386955
H  -6.645314 -2.506989 -0.452588
H  -5.138266 -2.912212 -1.436879
elementType: O C H
totalener: -965.41557203 hartree
nucrepener: 1808.94614418 hartree
electener: -2774.36171621 hartree
oneelecener: -4904.46257993 hartree
twoeener: 2130.10086372 hartree
cpcmener: -0.03808367 hartree
kineticenergy: 961.00116976 hartree
xcener: -95.144569888094 hartree
chargesum: 0.0000000
charge: -0.299908 -0.490637 -0.497362 0.112504 0.023553 -0.089052 -0.279075 -0.278951 -0.284229 0.401400 -0.051565 0.296419 -0.251553 -0.218857 -0.151668 -0.001389 -0.120476 0.318040 -0.287724 -0.113562 -0.175726 -0.293778 0.095168 0.090162 0.091033 0.097821 0.098222 0.092417 0.102631 0.095684 0.121884 0.120943 0.097621 0.089855 0.095020 0.093097 0.093826 0.088776 0.112463 0.108576 0.115761 0.107287 0.127899 0.110673 0.094030 0.144123 0.132402 0.116220
qa: -0.2999 -0.4906 -0.4974 0.1125 0.0236 -0.0891 -0.2791 -0.2790 -0.2842 0.4014 -0.0516 0.2964 -0.2516 -0.2189 -0.1517 -0.0014 -0.1205 0.3180 -0.2877 -0.1136 -0.1757 -0.2938 0.0952 0.0902 0.0910 0.0978 0.0982 0.0924 0.1026 0.0957 0.1219 0.1209 0.0976 0.0899 0.0950 0.0931 0.0938 0.0888 0.1125 0.1086 0.1158 0.1073 0.1279 0.1107 0.0940 0.1441 0.1324 0.1162
va: 2.1338 2.0190 1.9968 3.6820 3.7979 3.7983 3.9086 3.9030 3.8785 4.1871 3.7630 3.7495 3.9391 3.9193 3.8858 3.6695 3.4552 4.0379 3.9392 3.8674 3.7806 3.9400 1.0296 1.0365 1.0067 1.0010 1.0012 1.0165 1.0018 1.0012 1.0104 0.9918 0.9962 1.0109 0.9974 0.9962 0.9962 1.0086 1.0227 1.0227 0.9965 1.0127 0.9960 1.0057 1.0266 1.0024 1.0029 1.0087
dispcorr: -0.023321193 hartree
energy: -965.438893218393
dipole: 19.86000 -18.26736 1.59264 -11.01899 8.97738 -2.04161 -1.66339 3.35455 1.69116
magnitude: 3.09268 au
magnitude: 7.86097 debye
