program: Orca
programVersion: 5.0.2
elementType: O O O C C C C C C C C C C C C C C C C C C C H H H H H H H H H H H H H H H H H H H H H H H H H H
charge: 0
multiplicity: 1
keywords: wb97x-d3
keywords: def2-TZVPP
keywords: def2/J RIJCOSX
keywords: DEFGRID2
keywords: scfconv7
keywords: smallprint printgap noloewdin
keywords: NOSOSCF
formula: C19H26O3
InChI: InChI=1/C19H26O3/c1-7-8-13-12(4)16(10-15(13)20)22-18(21)17-14(9-11(2)3)19(17,5)6/h7,9,14,16-17H,1,8,10H2,2-6H3
48 atoms
O  -0.418134 0.382134 1.665162
O  -0.166714 0.205907 -0.552043
O  -4.122834 2.265584 -0.611273
C  2.390581 -1.386736 0.431624
C  2.781024 -0.065561 -0.159398
C  1.707624 -0.110687 0.903705
C  3.30897 -2.046045 1.431174
C  1.654282 -2.37541 -0.437536
C  4.070469 0.586343 0.156608
C  0.303808 0.172869 0.56207
C  5.021776 0.916051 -0.722378
C  -1.822199 0.625121 1.570698
C  4.943872 0.65807 -2.195853
C  6.286807 1.581301 -0.270992
C  -2.243219 1.920531 0.884638
C  -2.605596 -0.461569 0.879733
C  -3.564126 0.052993 0.09182
C  -3.415679 1.508189 0.026853
C  -2.337031 -1.889875 1.16563
C  -4.632699 -0.667007 -0.656737
C  -4.271159 -1.056916 -2.059415
C  -3.084502 -0.917132 -2.637041
H  2.406582 0.094533 -1.165319
H  1.999421 0.213347 1.896855
H  3.772983 -1.334414 2.112826
H  2.759812 -2.771161 2.034282
H  4.107756 -2.583493 0.916114
H  0.97659 -2.993052 0.155978
H  1.076858 -1.906574 -1.231373
H  2.373365 -3.044931 -0.913346
H  4.250149 0.808149 1.204748
H  -2.130883 0.639504 2.618282
H  5.051804 1.589276 -2.757652
H  4.017006 0.182899 -2.510993
H  5.76815 0.013502 -2.511489
H  6.415991 2.550377 -0.760089
H  7.161448 0.98308 -0.53904
H  6.305688 1.742685 0.806573
H  -1.459329 2.351016 0.259833
H  -2.543045 2.6913 1.595445
H  -3.134366 -2.536346 0.804002
H  -1.411145 -2.212087 0.681787
H  -2.207625 -2.058179 2.235936
H  -5.532335 -0.045025 -0.691966
H  -4.932873 -1.568304 -0.114231
H  -5.083287 -1.500672 -2.627035
H  -2.924223 -1.23964 -3.657645
H  -2.232888 -0.486902 -2.125535
elementType: O C H
totalener: -965.41674740 hartree
nucrepener: 1831.89834302 hartree
electener: -2797.31509042 hartree
oneelecener: -4950.63206780 hartree
twoeener: 2153.31697738 hartree
cpcmener: -0.03918246 hartree
kineticenergy: 961.00148370 hartree
xcener: -95.145847386168 hartree
chargesum: -0.0000000
charge: -0.298327 -0.498087 -0.489216 0.141558 0.033430 -0.124571 -0.267661 -0.299374 -0.291853 0.410353 -0.039565 0.298451 -0.253329 -0.223593 -0.154769 -0.011069 -0.140889 0.317309 -0.259534 -0.090295 -0.186512 -0.287143 0.093387 0.089230 0.090016 0.098168 0.096811 0.097554 0.096021 0.104743 0.123750 0.122182 0.095972 0.090848 0.096892 0.094420 0.093768 0.089432 0.113604 0.108287 0.107211 0.116851 0.120365 0.091595 0.104291 0.135204 0.132016 0.112071
qa: -0.2983 -0.4981 -0.4892 0.1416 0.0334 -0.1246 -0.2677 -0.2994 -0.2919 0.4104 -0.0396 0.2985 -0.2533 -0.2236 -0.1548 -0.0111 -0.1409 0.3173 -0.2595 -0.0903 -0.1865 -0.2871 0.0934 0.0892 0.0900 0.0982 0.0968 0.0976 0.0960 0.1047 0.1237 0.1222 0.0960 0.0908 0.0969 0.0944 0.0938 0.0894 0.1136 0.1083 0.1072 0.1169 0.1204 0.0916 0.1043 0.1352 0.1320 0.1121
va: 2.1363 1.9999 2.0067 3.6564 3.7770 3.8903 3.9033 3.9055 3.8661 4.1305 3.7341 3.7429 3.9438 3.9226 3.8786 3.6743 3.4561 4.0321 3.9430 3.8372 3.8318 3.8908 1.0313 1.0398 1.0046 1.0025 1.0027 0.9995 1.0145 1.0022 1.0076 0.9931 0.9972 1.0089 0.9972 0.9959 0.9964 1.0084 1.0268 1.0237 1.0031 0.9944 1.0000 1.0156 1.0022 0.9999 1.0044 1.0242
dispcorr: -0.024279742 hartree
energy: -965.441027141781
dipole: 22.94677 -21.30864 1.63813 -11.42001 9.52720 -1.89281 -3.30643 5.38396 2.07754
magnitude: 3.25305 au
magnitude: 8.26861 debye
