program: Orca
programVersion: 5.0.2
elementType: O O O C C C C C C C C C C C C C C C C C C C H H H H H H H H H H H H H H H H H H H H H H H H H H
charge: 0
multiplicity: 1
keywords: wb97x-d3
keywords: def2-TZVPP
keywords: def2/J RIJCOSX
keywords: DEFGRID2
keywords: scfconv7
keywords: smallprint printgap noloewdin
keywords: NOSOSCF
formula: C19H26O3
InChI: InChI=1/C19H26O3/c1-7-8-13-12(4)16(10-15(13)20)22-18(21)17-14(9-11(2)3)19(17,5)6/h7,9,14,16-17H,1,8,10H2,2-6H3
48 atoms
O  -0.412779 0.080242 1.000041
O  0.439632 -1.978894 1.240076
O  -4.732453 1.58271 0.790356
C  3.045585 -0.381402 1.981614
C  3.122379 -0.848451 0.570615
C  1.891823 -0.087922 1.030377
C  3.848364 0.828936 2.394143
C  2.892671 -1.395253 3.087842
C  4.045276 -0.232829 -0.418664
C  0.599768 -0.785857 1.107794
C  3.740496 0.03354 -1.691438
C  -1.763621 -0.396179 1.023596
C  2.397193 -0.245247 -2.294433
C  4.736915 0.657767 -2.6199
C  -2.665343 0.654594 1.654991
C  -2.28485 -0.562319 -0.383412
C  -3.410268 0.141463 -0.5845
C  -3.745939 0.890592 0.628893
C  -1.589828 -1.42956 -1.363891
C  -4.216797 0.237847 -1.833164
C  -3.679218 1.216817 -2.837999
C  -2.537605 1.889723 -2.755685
H  2.949842 -1.915088 0.44347
H  1.822641 0.944724 0.708381
H  4.867295 0.540369 2.659186
H  3.908928 1.57945 1.606259
H  3.402116 1.303217 3.269898
H  3.877706 -1.654331 3.480005
H  2.30872 -0.989172 3.915836
H  2.421684 -2.319404 2.762278
H  5.047468 -0.001996 -0.067197
H  -1.816345 -1.344856 1.561388
H  1.766801 -0.874386 -1.668579
H  2.507016 -0.74072 -3.261755
H  1.857773 0.686769 -2.48556
H  5.683725 0.872401 -2.124825
H  4.350698 1.593424 -3.032528
H  4.93958 0.005994 -3.473242
H  -2.129645 1.589393 1.833993
H  -3.092157 0.336471 2.606274
H  -2.135654 -1.500282 -2.30313
H  -0.592107 -1.041902 -1.589766
H  -1.454567 -2.436708 -0.963256
H  -5.244529 0.519238 -1.586916
H  -4.29585 -0.74195 -2.31366
H  -4.3087 1.356568 -3.711804
H  -2.241173 2.573072 -3.541241
H  -1.863831 1.801893 -1.911401
elementType: O C H
totalener: -965.41719607 hartree
nucrepener: 1833.81508415 hartree
electener: -2799.23228022 hartree
oneelecener: -4953.63313576 hartree
twoeener: 2154.40085554 hartree
cpcmener: -0.03481586 hartree
kineticenergy: 960.98978986 hartree
xcener: -95.141072380265 hartree
chargesum: 0.0000000
charge: -0.295529 -0.500112 -0.484335 0.148994 -0.000216 -0.112460 -0.286393 -0.285599 -0.316515 0.391749 -0.007003 0.275924 -0.234862 -0.230116 -0.151354 -0.047307 -0.098499 0.325242 -0.259997 -0.066037 -0.189705 -0.280973 0.103764 0.094798 0.099462 0.094042 0.098314 0.096167 0.101443 0.092048 0.124042 0.111000 0.074669 0.102795 0.105595 0.090102 0.095380 0.097463 0.103042 0.103125 0.107433 0.115605 0.124046 0.089169 0.104799 0.134181 0.133232 0.109388
qa: -0.2955 -0.5001 -0.4843 0.1490 -0.0002 -0.1125 -0.2864 -0.2856 -0.3165 0.3917 -0.0070 0.2759 -0.2349 -0.2301 -0.1514 -0.0473 -0.0985 0.3252 -0.2600 -0.0660 -0.1897 -0.2810 0.1038 0.0948 0.0995 0.0940 0.0983 0.0962 0.1014 0.0920 0.1240 0.1110 0.0747 0.1028 0.1056 0.0901 0.0954 0.0975 0.1030 0.1031 0.1074 0.1156 0.1240 0.0892 0.1048 0.1342 0.1332 0.1094
va: 2.1232 1.9944 2.0142 3.6896 3.7979 3.8297 3.9080 3.8947 3.8956 4.1495 3.7042 3.7155 3.9246 3.9316 3.9167 3.7205 3.4604 4.0191 3.9343 3.8322 3.8395 3.8978 1.0260 1.0307 0.9999 1.0019 1.0028 1.0009 0.9985 1.0181 1.0035 1.0284 1.0109 1.0014 0.9965 1.0060 0.9959 0.9961 1.0287 1.0233 1.0052 0.9917 1.0059 1.0227 1.0006 1.0015 1.0042 1.0206
dispcorr: -0.024386049 hartree
energy: -965.441582115305
dipole: 21.02557 -19.27270 1.75287 0.34483 -0.74393 -0.39911 -8.53853 7.72624 -0.81229
magnitude: 1.97273 au
magnitude: 5.01427 debye
