program: Orca
programVersion: 5.0.2
elementType: O O O C C C C C C C C C C C C C C C C C C C H H H H H H H H H H H H H H H H H H H H H H H H H H
charge: 0
multiplicity: 1
keywords: wb97x-d3
keywords: def2-TZVPP
keywords: def2/J RIJCOSX
keywords: DEFGRID2
keywords: scfconv7
keywords: smallprint printgap noloewdin
keywords: NOSOSCF
formula: C19H26O3
InChI: InChI=1/C19H26O3/c1-7-8-13-12(4)16(10-15(13)20)22-18(21)17-14(9-11(2)3)19(17,5)6/h7,9,14,16-17H,1,8,10H2,2-6H3
48 atoms
O  -0.33742 -0.086418 -0.912623
O  0.573857 1.941734 -1.205721
O  -4.746826 -1.366621 -0.691304
C  3.068792 0.223492 -2.050957
C  3.249541 0.742246 -0.665568
C  1.971222 0.009519 -1.019537
C  2.881394 1.204688 -3.181909
C  3.808496 -1.027041 -2.464893
C  4.225269 0.139287 0.279105
C  0.695496 0.752351 -1.064555
C  4.034796 -0.033626 1.587703
C  -1.66772 0.434943 -0.934079
C  5.094495 -0.641148 2.456566
C  2.774101 0.355898 2.297781
C  -2.611704 -0.588477 -1.551808
C  -2.184098 0.64329 0.47067
C  -3.342783 0.0035 0.676858
C  -3.726829 -0.747689 -0.534403
C  -1.438823 1.499487 1.429401
C  -4.1840 -0.051598 1.910569
C  -3.796802 -1.230318 2.757234
C  -4.536212 -2.318687 2.914167
H  3.117131 1.818035 -0.57328
H  1.884429 -1.006819 -0.652701
H  2.404839 2.129336 -2.866742
H  3.85415 1.460175 -3.606323
H  2.279034 0.770418 -3.982103
H  3.908538 -1.743596 -1.649762
H  3.286969 -1.526301 -3.283071
H  4.813001 -0.782504 -2.816619
H  5.181404 -0.158967 -0.142176
H  -1.678458 1.382758 -1.478613
H  5.411679 0.055157 3.236709
H  4.719128 -1.531269 2.967937
H  5.976635 -0.929448 1.886232
H  2.996935 1.01727 3.138689
H  2.064726 0.870287 1.652787
H  2.27641 -0.522257 2.717959
H  -2.112094 -1.549692 -1.688713
H  -3.007529 -0.288218 -2.522198
H  -0.488732 1.036323 1.706018
H  -1.999465 1.668317 2.347114
H  -1.197077 2.46591 0.985504
H  -4.076231 0.871788 2.485507
H  -5.234271 -0.13079 1.623843
H  -2.82493 -1.16928 3.238119
H  -4.200898 -3.147474 3.522634
H  -5.499876 -2.423885 2.43205
totalener: -965.40523198 hartree
nucrepener: 1808.65117577 hartree
electener: -2774.05640775 hartree
oneelecener: -4903.30729787 hartree
twoeener: 2129.25089012 hartree
kineticenergy: 961.03972512 hartree
xcener: -95.137185542080 hartree
chargesum: -0.0000000
charge: -0.269049 -0.389703 -0.326861 0.125899 -0.016034 -0.121119 -0.259491 -0.273504 -0.240836 0.313889 -0.005657 0.231205 -0.212074 -0.211760 -0.143194 -0.069690 -0.033608 0.222832 -0.252314 -0.130213 -0.149405 -0.193917 0.107320 0.087836 0.101403 0.084984 0.086695 0.086407 0.091957 0.091057 0.093854 0.099165 0.087963 0.085584 0.079587 0.093332 0.059461 0.093039 0.089864 0.086628 0.096198 0.093213 0.122376 0.099011 0.093615 0.103780 0.099638 0.090634
qa: -0.2690 -0.3897 -0.3269 0.1259 -0.0160 -0.1211 -0.2595 -0.2735 -0.2408 0.3139 -0.0057 0.2312 -0.2121 -0.2118 -0.1432 -0.0697 -0.0336 0.2228 -0.2523 -0.1302 -0.1494 -0.1939 0.1073 0.0878 0.1014 0.0850 0.0867 0.0864 0.0920 0.0911 0.0939 0.0992 0.0880 0.0856 0.0796 0.0933 0.0595 0.0930 0.0899 0.0866 0.0962 0.0932 0.1224 0.0990 0.0936 0.1038 0.0996 0.0906
va: 2.1193 2.1047 2.1720 3.7320 3.8128 3.8271 3.9042 3.9106 3.9006 4.2283 3.7453 3.7562 3.9428 3.9353 3.8753 3.7347 3.4039 4.1299 3.9406 3.8848 3.8431 3.9780 1.0257 1.0330 1.0202 1.0025 1.0018 1.0046 1.0064 1.0015 1.0097 1.0282 0.9986 0.9988 1.0097 1.0033 1.0190 0.9992 1.0327 1.0285 1.0011 1.0082 1.0073 1.0045 1.0286 1.0089 1.0074 1.0195
dispcorr: -0.023335024 hartree
energy: -965.428567006549
dipole: 20.30087 -18.95732 1.34354 -1.18242 1.33769 0.15527 7.81131 -7.32878 0.48252
magnitude: 1.43598 au
magnitude: 3.64998 debye
