program: Orca
programVersion: 5.0.2
elementType: O O O C C C C C C C C C C C C C C C C C C C H H H H H H H H H H H H H H H H H H H H H H H H H H
charge: 0
multiplicity: 1
keywords: wb97x-d3
keywords: def2-TZVPP
keywords: def2/J RIJCOSX
keywords: DEFGRID2
keywords: scfconv7
keywords: smallprint printgap noloewdin
keywords: NOSOSCF
formula: C19H26O3
InChI: InChI=1/C19H26O3/c1-7-8-13-12(4)16(10-15(13)20)22-18(21)17-14(9-11(2)3)19(17,5)6/h7,9,14,16-17H,1,8,10H2,2-6H3
48 atoms
O  -0.424889 -0.049889 -0.90832
O  0.578842 1.951995 -1.043639
O  -4.988149 -0.887519 -1.007722
C  2.98768 0.151844 -2.025629
C  3.195473 0.638034 -0.633544
C  1.889539 -0.045683 -0.991858
C  2.820333 1.163765 -3.132377
C  3.681715 -1.112863 -2.473022
C  4.143493 0.002696 0.315631
C  0.646622 0.751287 -0.993112
C  4.031427 0.052227 1.643842
C  -1.722925 0.540197 -0.835479
C  5.055453 -0.57224 2.541545
C  2.894425 0.73037 2.345292
C  -2.728012 -0.262984 -1.649079
C  -2.243427 0.486749 0.58001
C  -3.471262 -0.045379 0.641225
C  -3.902065 -0.465862 -0.706783
C  -1.426694 1.012664 1.703583
C  -4.334823 -0.242115 1.838442
C  -4.021584 -1.477044 2.635442
C  -3.022465 -2.322223 2.424527
H  3.089812 1.714396 -0.52349
H  1.767405 -1.066361 -0.647582
H  2.355013 2.086207 -2.794082
H  3.797491 1.417688 -3.54715
H  2.214268 0.757819 -3.944568
H  3.755974 -1.855012 -1.6783
H  3.142739 -1.572107 -3.303095
H  4.694073 -0.894378 -2.818817
H  5.003615 -0.505428 -0.11023
H  -1.668802 1.578664 -1.172011
H  4.599754 -1.313877 3.202209
H  5.847938 -1.064517 1.979455
H  5.518699 0.177004 3.188342
H  2.346786 0.018987 2.969315
H  3.264248 1.508145 3.018073
H  2.184492 1.193783 1.662758
H  -2.317356 -1.239744 -1.915104
H  -3.037922 0.223289 -2.573749
H  -1.978337 1.017421 2.641488
H  -1.077575 2.025181 1.493075
H  -0.53663 0.396702 1.852119
H  -4.274908 0.627837 2.500944
H  -5.378525 -0.292796 1.515126
H  -4.701825 -1.668132 3.459517
H  -2.884705 -3.187774 3.05754
H  -2.31229 -2.193218 1.617783
totalener: -965.40563975 hartree
nucrepener: 1818.65719176 hartree
electener: -2784.06283151 hartree
oneelecener: -4923.25123453 hartree
twoeener: 2139.18840302 hartree
kineticenergy: 961.04322753 hartree
xcener: -95.140336330672 hartree
chargesum: -0.0000000
charge: -0.275309 -0.388185 -0.323841 0.131165 -0.030398 -0.084700 -0.255828 -0.279339 -0.235909 0.299491 0.007473 0.240996 -0.212473 -0.236876 -0.148969 -0.081359 -0.074787 0.242934 -0.241352 -0.088072 -0.153501 -0.204512 0.104425 0.082736 0.100298 0.086169 0.087015 0.083055 0.092292 0.094017 0.094252 0.103965 0.085240 0.079252 0.087436 0.088309 0.093231 0.071362 0.088270 0.087363 0.096678 0.123622 0.094567 0.085021 0.098024 0.102628 0.101620 0.082505
qa: -0.2753 -0.3882 -0.3238 0.1312 -0.0304 -0.0847 -0.2558 -0.2793 -0.2359 0.2995 0.0075 0.2410 -0.2125 -0.2369 -0.1490 -0.0814 -0.0748 0.2429 -0.2414 -0.0881 -0.1535 -0.2045 0.1044 0.0827 0.1003 0.0862 0.0870 0.0831 0.0923 0.0940 0.0943 0.1040 0.0852 0.0793 0.0874 0.0883 0.0932 0.0714 0.0883 0.0874 0.0967 0.1236 0.0946 0.0850 0.0980 0.1026 0.1016 0.0825
va: 2.1196 2.1069 2.1791 3.7523 3.8235 3.7903 3.8979 3.9130 3.9065 4.2465 3.7149 3.7340 3.9424 3.9489 3.8796 3.6926 3.4345 4.0984 3.9344 3.8586 3.8848 3.9312 1.0270 1.0346 1.0195 1.0025 1.0021 1.0044 1.0066 1.0001 1.0099 1.0312 0.9989 1.0098 0.9983 0.9988 1.0030 1.0176 1.0305 1.0296 1.0079 1.0049 1.0024 0.9994 1.0229 1.0092 1.0110 1.0244
dispcorr: -0.023752515 hartree
energy: -965.429392267498
dipole: 21.89585 -20.55698 1.33887 -2.11791 2.11918 0.00127 8.47046 -7.77890 0.69156
magnitude: 1.50693 au
magnitude: 3.83031 debye
