program: Orca
programVersion: 5.0.2
elementType: O O O C C C C C C C C C C C C C C C C C C C H H H H H H H H H H H H H H H H H H H H H H H H H H
charge: 0
multiplicity: 1
keywords: wb97x-d3
keywords: def2-TZVPP
keywords: def2/J RIJCOSX
keywords: DEFGRID2
keywords: scfconv7
keywords: smallprint printgap noloewdin
keywords: NOSOSCF
formula: C19H26O3
InChI: InChI=1/C19H26O3/c1-7-8-13-12(4)16(10-15(13)20)22-18(21)17-14(9-11(2)3)19(17,5)6/h7,9,14,16-17H,1,8,10H2,2-6H3
48 atoms
O  -0.509016 -0.042215 -1.00797
O  0.517472 1.951873 -0.959292
O  -5.053005 -0.912189 -1.035758
C  2.972403 0.275327 -1.98204
C  3.087845 0.542558 -0.518748
C  1.803755 -0.060138 -1.073329
C  2.901771 1.453231 -2.923321
C  3.678244 -0.915601 -2.587192
C  3.949005 -0.234306 0.395426
C  0.571511 0.750389 -1.014723
C  4.13321 0.021138 1.692843
C  -1.800934 0.555036 -0.888003
C  5.065715 -0.813106 2.518184
C  3.452544 1.129227 2.438871
C  -2.822868 -0.219035 -1.709125
C  -2.294319 0.456439 0.535297
C  -3.513568 -0.094346 0.604545
C  -3.968859 -0.476855 -0.746244
C  -1.463672 0.955056 1.661321
C  -4.345576 -0.34357 1.81447
C  -3.951941 -1.56121 2.602956
C  -2.917597 -2.356423 2.368455
H  2.975537 1.59142 -0.264652
H  1.651916 -1.118569 -0.895975
H  2.33499 1.202051 -3.82188
H  2.443349 2.329127 -2.471876
H  3.910074 1.728951 -3.237223
H  3.652126 -1.79772 -1.948064
H  3.210141 -1.189713 -3.533798
H  4.724784 -0.68154 -2.79079
H  4.484486 -1.076344 -0.031781
H  -1.746646 1.603377 -1.192192
H  5.861926 -0.201372 2.949929
H  4.541264 -1.277516 3.356999
H  5.533376 -1.60529 1.934798
H  2.715068 1.666175 1.845278
H  2.93947 0.734609 3.31965
H  4.181826 1.85564 2.807457
H  -2.412831 -1.177274 -2.035918
H  -3.164646 0.308851 -2.599258
H  -1.118885 1.97299 1.473334
H  -0.571054 0.33709 1.782569
H  -2.003451 0.932354 2.60581
H  -4.322861 0.526534 2.479359
H  -5.390056 -0.449934 1.507401
H  -4.602384 -1.784371 3.442824
H  -2.723266 -3.21356 2.998256
H  -2.234699 -2.195111 1.544501
totalener: -965.40620782 hartree
nucrepener: 1809.23199123 hartree
electener: -2774.63819906 hartree
oneelecener: -4904.42415491 hartree
twoeener: 2129.78595585 hartree
kineticenergy: 961.04098261 hartree
xcener: -95.140813994367 hartree
chargesum: -0.0000000
charge: -0.278568 -0.394879 -0.325247 0.110943 -0.033113 -0.047327 -0.252709 -0.278705 -0.184651 0.305257 -0.019645 0.248302 -0.214063 -0.251501 -0.149226 -0.100304 -0.068612 0.239903 -0.233207 -0.087757 -0.155408 -0.204445 0.099122 0.078705 0.085133 0.100404 0.086083 0.073183 0.093594 0.100069 0.084666 0.102826 0.086174 0.084226 0.077723 0.080730 0.083728 0.092718 0.088755 0.087054 0.123496 0.098497 0.095947 0.086008 0.098332 0.102621 0.101464 0.083700
qa: -0.2786 -0.3949 -0.3252 0.1109 -0.0331 -0.0473 -0.2527 -0.2787 -0.1847 0.3053 -0.0196 0.2483 -0.2141 -0.2515 -0.1492 -0.1003 -0.0686 0.2399 -0.2332 -0.0878 -0.1554 -0.2044 0.0991 0.0787 0.0851 0.1004 0.0861 0.0732 0.0936 0.1001 0.0847 0.1028 0.0862 0.0842 0.0777 0.0807 0.0837 0.0927 0.0888 0.0871 0.1235 0.0985 0.0959 0.0860 0.0983 0.1026 0.1015 0.0837
va: 2.1227 2.1020 2.1784 3.8042 3.8240 3.8152 3.8999 3.9185 3.9151 4.2531 3.7657 3.7289 3.9427 3.9496 3.8807 3.7271 3.4225 4.0980 3.9382 3.8576 3.8843 3.9304 1.0236 1.0353 1.0027 1.0205 1.0016 1.0070 1.0049 1.0001 1.0163 1.0300 0.9973 0.9987 1.0114 1.0158 0.9995 0.9998 1.0309 1.0293 1.0070 1.0004 1.0056 0.9990 1.0241 1.0093 1.0114 1.0244
dispcorr: -0.022946201 hartree
energy: -965.429154024607
dipole: 23.35029 -21.98338 1.36691 -1.20502 1.25257 0.04755 8.64527 -8.02165 0.62361
magnitude: 1.50320 au
magnitude: 3.82083 debye
