program: Gaussian 09
title: 000072864
version: EM64L-G09RevD.01
frameworkgroup: C1[X(C8H7ClO)]
method: RPBEPBE
basis: SDD
operation: Freq
keyword: #p
keyword: freq=noraman
keyword: PBEPBE/SDD
title: #p freq=noraman PBEPBE/SDD
converged: YES YES NO NO
title: Mulliken charges:
elementType: Cl O C C C C C C C C H H H H H H H
charge: -0.003046 -0.191419 0.397435 -0.272732 -0.323847 0.130377 -0.219346 -0.249918 -0.212028 -0.783860 0.245931 0.261946 0.237540 0.240599 0.235875 0.241441 0.265053
chargesum: 0.00000
title: Mulliken charges with hydrogens summed into heavy atoms:
elementType: Cl O C C C C C C C C
charge: -0.003046 -0.191419 0.397435 -0.272732 -0.077916 0.130377 0.042599 -0.012379 0.028571 -0.041491
polarizability: 1.23108930e+02 7.40014918e+00 1.17868384e+02 -8.12026533e-01 -1.57645991e-01 4.42090871e+01
1716.lowfreq: -8.3253 -0.0035 -0.0009 0.0011 6.6290 8.2417 34.4981 108.5842 160.6982
frequency: 34.3054 108.5824 160.6951 188.0597 200.6844 282.7387 341.2259 397.2241 419.4791 469.0794 504.3315 577.4975 595.2257 651.7884 729.6874 742.6099 764.1044 869.7631 946.1256 954.0760 991.4846 1019.7109 1021.3971 1036.6716 1085.6124 1135.2523 1177.9044 1245.1130 1266.8526 1369.0009 1373.0829 1417.4628 1448.8429 1456.3034 1464.4954 1564.8761 1594.8271 1612.2130 2986.4302 3075.1678 3125.2003 3140.3217 3154.7587 3168.5212 3178.3682
redmass: 5.4126 3.8985 1.0681 8.0710 5.0281 4.3515 12.7117 4.0900 3.9822 3.8783 4.3949 4.1554 2.8888 6.0742 3.4253 5.6390 1.2711 1.3588 2.3352 1.3889 1.3433 1.8965 3.9359 3.4534 2.0182 1.6203 1.0672 3.6685 1.4364 2.6262 1.8667 2.1028 1.1796 2.0082 1.0536 5.8363 6.5307 8.6577 1.0384 1.0956 1.0999 1.0859 1.0903 1.0944 1.1002
irintensity: 4.3137 0.1310 0.3603 1.2460 1.2101 2.1734 2.0151 0.1355 2.4405 7.7581 4.9555 19.2084 7.9495 9.4463 4.3459 10.5797 86.9486 0.1814 28.3575 1.7227 0.1339 7.9948 34.9330 11.6338 3.6511 2.6464 2.3686 179.1076 12.5542 7.3899 49.1654 27.4540 28.5223 26.0925 19.1948 22.0478 86.6013 77.7897 3.2682 12.5391 12.4281 0.8849 8.3534 12.4138 12.1194
temp: 298.150 k
press: 1.00000 atm
elementType: 17 8 6 6 6 6 6 6 6 6 1 1 1 1 1 1 1
symmnumber: 1
zpe: 329255.1 jmol-1
zpe.correction: 0.125407 hartree
zpe.thermalcorrener: 0.134664 hartree
zpe.thermalcorrenthalpy: 0.135608 hartree
zpe.thermalcorrgfe: 0.089955 hartree
zpe.sumelectzpe: -843.609265 hartree
zpe.sumelectthermal: -843.600008 hartree
zpe.sumelectthermalent: -843.599063 hartree
zpe.sumelectthermalfe: -843.644716 hartree
dipole: -2.6739 -4.0428 0.7929
dipole: 4.9115
quadrupole: -60.4968 -60.7369 -67.7255
quadrupole: -5.3931 2.3202 0.9825
quadrupole: 2.4896 2.2495 -4.7391 -5.3931 2.3202 0.9825
hfenergy: -843.7346716 hartree
pointgroup: C01 [X(C8H7Cl1O1)]
dipole: -1.1694588 1.5035692 -0.3249659 debye
dipolederiv: -0.101772 0.1991783 0.0188923 0.1613668 -0.68554 -0.0064296 0.0209729 -0.033031 -0.0384594 -0.859281 0.0708033 -0.0329894 0.2358793 -0.5335774 0.1419988 -0.0371277 0.1341598 -0.3569588 -0.7558821 -0.0671829 0.0524691 -0.0702384 -0.3304097 0.049258 0.1066819 0.0457539 0.0122999 0.2805367 -0.4631279 -0.0232063 -0.0796344 1.0341835 0.0192367 -0.0855172 0.0428869 -0.0529409 0.1465939 0.0563796 -0.0300787 -0.0951573 0.0078282 -0.0098356 0.0403554 0.0013795 -0.1361313 1.5833149 0.2424535 -0.0889522 0.0585144 0.7642917 -0.3341455 -0.13475 -0.2818801 0.2607325 -0.1880894 0.2847438 0.006884 0.1787966 -0.2152247 -0.0120926 0.0030775 -0.0286443 -0.1054298 -0.1871327 -0.1680677 0.0078876 -0.1485653 0.0128051 0.0083961 0.0074788 0.0091956 -0.1616997 0.1449494 0.0244659 -0.0220292 -0.0011518 0.1480798 -0.0079453 -0.0216019 -0.0065421 -0.1276041 -0.1891669 -0.1920332 0.0815017 -0.2675344 -0.3490945 0.1604203 0.0885704 0.1142942 0.0022747 0.0595061 -0.0804406 0.0044186 -0.081052 -0.0378363 0.0151779 -0.0026233 0.0109679 0.1421144 0.0522557 -0.0502359 0.0098523 -0.0750915 -0.0084448 0.0097551 0.0124453 0.0028032 0.1616624 0.0394245 0.0710924 0.0072357 0.089662 -0.06519 0.0004791 0.0035801 -0.0006673 0.1659863 -0.1009583 0.0145 0.0209029 0.009159 0.0836527 0.0008807 0.0189791 0.0016453 0.1581237 0.1163331 0.0343567 0.0471817 0.0043776 -0.0016418 -0.0782214 0.0232529 -0.0934133 0.0015907 0.0446551 0.0213012 -0.106593 0.013356 0.0789846 0.044973 -0.0747701 0.061148 -0.0335285 -0.085287 0.0018134 0.0466228 0.0673134 0.0971336 -0.0019059 0.030996 0.0199437 0.1079681 unknown
polarizability: 123.6167168|-7.3810832|116.6851056|-5.0739002|-4.6108178|44.8845791 unknown
InChI: InChI=1S/C8H7ClO/c1-6(10)7-4-2-3-5-8(7)9/h2-5H,1H3
charge 0 multiplicity 1
17 atoms
Cl 0.182108 -2.744888 -0.06646
O  2.47493 -0.873075 0.19782
C  0.273066 0.105255 -0.116075
C  -0.52468 -1.070459 -0.016671
C  -0.419506 1.352287 -0.118064
C  1.782553 0.106364 -0.191589
C  -1.930094 -1.007398 0.086486
C  -1.820095 1.432267 -0.002384
C  -2.580049 0.245073 0.101877
C  2.469724 1.357644 -0.74346
H  0.160141 2.276775 -0.196608
H  -2.505354 -1.935407 0.151959
H  -2.315155 2.408531 0.005416
H  -3.670811 0.286963 0.189085
H  2.428841 2.18571 -0.009898
H  2.002616 1.711463 -1.679314
H  3.528266 1.116796 -0.92472
