program: Orca
programVersion: 5.0.2
elementType: O O O C C C C C C C C C C C C C C C C C C C H H H H H H H H H H H H H H H H H H H H H H H H H H
charge: 0
multiplicity: 1
keywords: wb97x-d3
keywords: def2-TZVPP
keywords: def2/J RIJCOSX
keywords: DEFGRID2
keywords: scfconv7
keywords: smallprint printgap noloewdin
keywords: NOSOSCF
formula: C19H26O3
InChI: InChI=1/C19H26O3/c1-7-8-13-12(4)16(10-15(13)20)22-18(21)17-14(9-11(2)3)19(17,5)6/h7,9,14,16-17H,1,8,10H2,2-6H3
48 atoms
O  -0.448024 -0.04182 -0.746686
O  0.525511 1.794953 0.09556
O  -4.932468 -0.956107 -1.348768
C  3.043382 0.649306 -1.380045
C  3.116523 0.310997 0.07671
C  1.864177 -0.023424 -0.695543
C  2.972094 2.099406 -1.791462
C  3.80286 -0.213045 -2.358133
C  3.964909 -0.790207 0.601982
C  0.610983 0.700683 -0.397627
C  5.264914 -0.681439 0.878118
C  -1.761287 0.478362 -0.533353
C  6.045385 -1.832024 1.43697
C  6.042909 0.581608 0.670321
C  -2.703341 -0.022639 -1.620319
C  -2.347135 -0.042545 0.758719
C  -3.545872 -0.609817 0.568649
C  -3.894724 -0.58452 -0.865131
C  -1.627398 0.148379 2.044594
C  -4.501565 -1.158155 1.578407
C  -5.453744 -0.091097 2.038581
C  -6.735562 -0.033912 1.70864
H  3.001664 1.166918 0.737264
H  1.722643 -1.066663 -0.957239
H  2.509217 2.731386 -1.038116
H  3.980718 2.47658 -1.971547
H  2.410249 2.21671 -2.720002
H  4.847609 0.099442 -2.410664
H  3.794233 -1.266231 -2.080735
H  3.37745 -0.124544 -3.359133
H  3.475714 -1.742372 0.786836
H  -1.71916 1.570469 -0.50506
H  5.431738 -2.723909 1.557326
H  6.887884 -2.087307 0.789601
H  6.468206 -1.58226 2.413322
H  6.422712 0.963935 1.621189
H  6.916772 0.398383 0.040454
H  5.45475 1.369939 0.204359
H  -2.238845 -0.824099 -2.198564
H  -3.010485 0.749966 -2.324984
H  -0.670084 -0.376584 2.040706
H  -2.20184 -0.217947 2.89313
H  -1.401882 1.202984 2.209627
H  -5.059351 -1.983006 1.13175
H  -3.956979 -1.565941 2.433715
H  -5.025043 0.689304 2.660397
H  -7.372164 0.768522 2.055518
H  -7.192393 -0.780012 1.071282
totalener: -965.40518166 hartree
nucrepener: 1771.09141256 hartree
electener: -2736.49659422 hartree
oneelecener: -4828.27730684 hartree
twoeener: 2091.78071262 hartree
kineticenergy: 961.04523311 hartree
xcener: -95.137814157473 hartree
chargesum: 0.0000000
charge: -0.274712 -0.389905 -0.328169 0.073924 -0.035030 -0.090674 -0.269246 -0.242960 -0.183409 0.319788 -0.031305 0.228529 -0.210518 -0.237739 -0.135510 -0.074877 -0.030993 0.217073 -0.234651 -0.129929 -0.151877 -0.192954 0.110525 0.080247 0.104937 0.083308 0.090672 0.086739 0.082717 0.095405 0.089374 0.097328 0.079217 0.084477 0.087089 0.097623 0.086136 0.082607 0.089234 0.085540 0.100363 0.088037 0.117521 0.092743 0.098364 0.104828 0.099748 0.090366
qa: -0.2747 -0.3899 -0.3282 0.0739 -0.0350 -0.0907 -0.2692 -0.2430 -0.1834 0.3198 -0.0313 0.2285 -0.2105 -0.2377 -0.1355 -0.0749 -0.0310 0.2171 -0.2347 -0.1299 -0.1519 -0.1930 0.1105 0.0802 0.1049 0.0833 0.0907 0.0867 0.0827 0.0954 0.0894 0.0973 0.0792 0.0845 0.0871 0.0976 0.0861 0.0826 0.0892 0.0855 0.1004 0.0880 0.1175 0.0927 0.0984 0.1048 0.0997 0.0904
va: 2.1228 2.1060 2.1701 3.7299 3.8159 3.8657 3.9061 3.9081 3.8511 4.2576 3.7450 3.7656 3.9397 3.9373 3.8814 3.7684 3.4014 4.1316 3.9462 3.8901 3.8434 3.9849 1.0235 1.0370 1.0205 1.0020 1.0028 1.0026 1.0071 1.0057 1.0130 1.0290 1.0106 0.9994 0.9980 1.0023 1.0000 1.0105 1.0318 1.0293 1.0029 1.0059 1.0044 1.0275 1.0021 1.0079 1.0072 1.0201
dispcorr: -0.022775784 hartree
energy: -965.427957446212
dipole: 25.17557 -23.57330 1.60227 0.11721 -0.21661 -0.09940 4.26844 -3.83137 0.43708
magnitude: 1.66379 au
magnitude: 4.22901 debye
