program: Orca
programVersion: 5.0.2
elementType: O O O C C C C C C C C C C C C C C C C C C C H H H H H H H H H H H H H H H H H H H H H H H H H H
charge: 0
multiplicity: 1
keywords: wb97x-d3
keywords: def2-TZVPP
keywords: def2/J RIJCOSX
keywords: DEFGRID2
keywords: scfconv7
keywords: smallprint printgap noloewdin
keywords: NOSOSCF
formula: C19H26O3
InChI: InChI=1/C19H26O3/c1-7-8-13-12(4)16(10-15(13)20)22-18(21)17-14(9-11(2)3)19(17,5)6/h7,9,14,16-17H,1,8,10H2,2-6H3
48 atoms
O  -0.503762 -0.077237 -0.761053
O  0.423963 1.752304 0.147149
O  -4.938985 -0.982875 -1.634515
C  2.988065 0.678544 -1.309611
C  3.03631 0.328139 0.144477
C  1.807636 -0.024604 -0.65682
C  2.899595 2.129771 -1.713214
C  3.783512 -0.159947 -2.280072
C  3.895287 -0.759102 0.681912
C  0.536309 0.671985 -0.370686
C  5.198744 -0.64052 0.936533
C  -1.827874 0.422275 -0.56777
C  5.991512 -1.776713 1.507212
C  5.969385 0.619579 0.688345
C  -2.724621 0.013838 -1.72884
C  -2.463102 -0.202367 0.650912
C  -3.649075 -0.758262 0.368971
C  -3.933941 -0.630746 -1.073325
C  -1.80156 -0.1144 1.977631
C  -4.6093 -1.404816 1.308169
C  -5.439506 -0.452727 2.121582
C  -5.361827 0.870341 2.119176
H  2.886261 1.174469 0.810595
H  1.691746 -1.067085 -0.933915
H  2.386188 2.238768 -2.670388
H  2.380684 2.743855 -0.98192
H  3.906126 2.534634 -1.836897
H  4.815906 0.191767 -2.32963
H  3.813051 -1.211356 -1.997875
H  3.360056 -0.090796 -3.283429
H  3.410241 -1.706877 0.897952
H  -1.790186 1.508118 -0.446447
H  6.819539 -2.048434 0.847885
H  6.435661 -1.502461 2.467319
H  5.380849 -2.665133 1.663192
H  6.816345 0.431438 0.02392
H  5.363151 1.406144 0.243045
H  6.38856 1.007002 1.620374
H  -2.229685 -0.718461 -2.369783
H  -3.023803 0.848492 -2.362996
H  -1.525562 0.91676 2.203624
H  -0.875735 -0.693887 1.989636
H  -2.442094 -0.479687 2.7774
H  -5.284574 -2.046983 0.735544
H  -4.077272 -2.07558 1.990923
H  -6.171733 -0.930989 2.764682
H  -6.013521 1.467273 2.741975
H  -4.659595 1.409712 1.496693
totalener: -965.40547433 hartree
nucrepener: 1781.81788284 hartree
electener: -2747.22335717 hartree
oneelecener: -4849.67600857 hartree
twoeener: 2102.45265140 hartree
kineticenergy: 961.04289443 hartree
xcener: -95.139877486441 hartree
chargesum: -0.0000000
charge: -0.276637 -0.391366 -0.325444 0.066107 -0.032454 -0.092674 -0.265798 -0.244130 -0.185713 0.327032 -0.028124 0.247096 -0.210437 -0.241087 -0.137193 -0.109600 -0.062500 0.234747 -0.227136 -0.089824 -0.157370 -0.203174 0.111072 0.081382 0.089577 0.104952 0.082415 0.086266 0.083359 0.096344 0.089298 0.096308 0.084707 0.086994 0.079398 0.087441 0.083305 0.098026 0.089104 0.086085 0.115353 0.105787 0.095391 0.096267 0.088054 0.102200 0.101905 0.084691
qa: -0.2766 -0.3914 -0.3254 0.0661 -0.0325 -0.0927 -0.2658 -0.2441 -0.1857 0.3270 -0.0281 0.2471 -0.2104 -0.2411 -0.1372 -0.1096 -0.0625 0.2347 -0.2271 -0.0898 -0.1574 -0.2032 0.1111 0.0814 0.0896 0.1050 0.0824 0.0863 0.0834 0.0963 0.0893 0.0963 0.0847 0.0870 0.0794 0.0874 0.0833 0.0980 0.0891 0.0861 0.1154 0.1058 0.0954 0.0963 0.0881 0.1022 0.1019 0.0847
va: 2.1204 2.1075 2.1779 3.7378 3.8136 3.8559 3.9063 3.9079 3.8541 4.2566 3.7444 3.7378 3.9391 3.9364 3.8742 3.7584 3.4133 4.1121 3.9326 3.8580 3.8822 3.9384 1.0245 1.0364 1.0030 1.0206 1.0025 1.0023 1.0069 1.0060 1.0130 1.0346 0.9991 0.9983 1.0105 0.9994 1.0107 1.0032 1.0318 1.0288 1.0072 1.0023 1.0057 1.0235 0.9977 1.0093 1.0109 1.0196
dispcorr: -0.023267085 hartree
energy: -965.428741416406
dipole: 26.02822 -24.47438 1.55384 0.81898 -1.04475 -0.22578 5.34453 -4.78769 0.55685
magnitude: 1.66598 au
magnitude: 4.23458 debye
