program: Orca
programVersion: 5.0.2
elementType: O O O C C C C C C C C C C C C C C C C C C C H H H H H H H H H H H H H H H H H H H H H H H H H H
charge: 0
multiplicity: 1
keywords: wb97x-d3
keywords: def2-TZVPP
keywords: def2/J RIJCOSX
keywords: DEFGRID2
keywords: scfconv7
keywords: smallprint printgap noloewdin
keywords: NOSOSCF
formula: C19H26O3
InChI: InChI=1/C19H26O3/c1-7-8-13-12(4)16(10-15(13)20)22-18(21)17-14(9-11(2)3)19(17,5)6/h7,9,14,16-17H,1,8,10H2,2-6H3
48 atoms
O  -0.352984 -0.033603 -0.932435
O  0.552539 1.797652 -0.008246
O  -4.828556 -1.122273 -1.345041
C  2.986248 0.998733 -1.830803
C  3.24266 0.62845 -0.408899
C  1.950721 0.18098 -1.075614
C  2.728736 2.448776 -2.163154
C  3.708499 0.265654 -2.936754
C  4.257925 -0.362744 0.011043
C  0.675846 0.760612 -0.607683
C  4.485105 -0.744917 1.269737
C  -1.676537 0.388224 -0.599727
C  5.570037 -1.724739 1.601292
C  3.700793 -0.250263 2.447116
C  -2.659895 -0.073325 -1.666728
C  -2.158898 -0.257905 0.677051
C  -3.348334 -0.853904 0.515544
C  -3.781095 -0.741133 -0.890542
C  -1.373794 -0.139577 1.932062
C  -4.1925 -1.525986 1.544275
C  -4.94201 -0.598424 2.458094
C  -4.889247 0.725834 2.467034
H  3.088349 1.449338 0.284289
H  1.891005 -0.861626 -1.366076
H  2.106535 2.539454 -3.055369
H  2.240408 2.989027 -1.356521
H  3.676255 2.948309 -2.372735
H  4.707991 0.679562 -3.08397
H  3.814855 -0.801134 -2.741952
H  3.166405 0.370763 -3.877623
H  4.875977 -0.796887 -0.7688
H  -1.688879 1.475341 -0.48308
H  6.10504 -2.062464 0.714464
H  6.30038 -1.285374 2.285327
H  5.164429 -2.605538 2.105279
H  3.2766 -1.091021 3.001254
H  4.345613 0.285839 3.147842
H  2.879809 0.409494 2.174641
H  -2.199088 -0.805995 -2.332543
H  -3.041499 0.735754 -2.289486
H  -1.150769 0.906029 2.149321
H  -0.41249 -0.650252 1.840386
H  -1.902836 -0.560706 2.78414
H  -4.917395 -2.169371 1.037479
H  -3.581592 -2.199314 2.154649
H  -5.589204 -1.098089 3.172287
H  -5.478371 1.300497 3.168206
H  -4.272669 1.288264 1.7779
totalener: -965.40582433 hartree
nucrepener: 1796.61948566 hartree
electener: -2762.02530999 hartree
oneelecener: -4879.23455494 hartree
twoeener: 2117.20924495 hartree
kineticenergy: 961.03433636 hartree
xcener: -95.139606234722 hartree
chargesum: -0.0000000
charge: -0.274974 -0.397468 -0.326028 0.113230 -0.042316 -0.049773 -0.254604 -0.280176 -0.192454 0.311173 -0.014301 0.249422 -0.215214 -0.246847 -0.135881 -0.114984 -0.058378 0.233122 -0.225941 -0.088163 -0.157292 -0.202999 0.100835 0.078939 0.085654 0.101116 0.087333 0.100138 0.074162 0.092762 0.089972 0.095191 0.078019 0.086304 0.084521 0.083559 0.091594 0.078587 0.089057 0.085877 0.116037 0.103367 0.095233 0.096957 0.087219 0.102097 0.102046 0.084271
qa: -0.2750 -0.3975 -0.3260 0.1132 -0.0423 -0.0498 -0.2546 -0.2802 -0.1925 0.3112 -0.0143 0.2494 -0.2152 -0.2468 -0.1359 -0.1150 -0.0584 0.2331 -0.2259 -0.0882 -0.1573 -0.2030 0.1008 0.0789 0.0857 0.1011 0.0873 0.1001 0.0742 0.0928 0.0900 0.0952 0.0780 0.0863 0.0845 0.0836 0.0916 0.0786 0.0891 0.0859 0.1160 0.1034 0.0952 0.0970 0.0872 0.1021 0.1020 0.0843
va: 2.1247 2.0946 2.1771 3.8075 3.8271 3.8227 3.8955 3.9179 3.9107 4.2413 3.7538 3.7488 3.9437 3.9515 3.8765 3.7561 3.4149 4.1130 3.9368 3.8581 3.8810 3.9380 1.0226 1.0354 1.0025 1.0206 1.0019 0.9994 1.0062 1.0057 1.0136 1.0335 1.0110 0.9976 0.9984 0.9996 1.0001 1.0173 1.0316 1.0290 1.0066 1.0021 1.0062 1.0241 0.9982 1.0093 1.0110 1.0193
dispcorr: -0.022799029 hartree
energy: -965.428623359612
dipole: 21.80935 -20.38343 1.42592 0.36371 -0.56482 -0.20111 7.17180 -6.68896 0.48283
magnitude: 1.51882 au
magnitude: 3.86054 debye
