program: Orca
programVersion: 5.0.2
elementType: O O O C C C C C C C C C C C C C C C C C C C H H H H H H H H H H H H H H H H H H H H H H H H H H
charge: 0
multiplicity: 1
keywords: wb97x-d3
keywords: def2-TZVPP
keywords: def2/J RIJCOSX
keywords: DEFGRID2
keywords: scfconv7
keywords: smallprint printgap noloewdin
keywords: NOSOSCF
formula: C19H26O3
InChI: InChI=1/C19H26O3/c1-7-8-13-12(4)16(10-15(13)20)22-18(21)17-14(9-11(2)3)19(17,5)6/h7,9,14,16-17H,1,8,10H2,2-6H3
48 atoms
O  -0.332899 0.057303 -0.943918
O  0.645533 1.911501 -0.14523
O  -4.810842 -1.048314 -1.068823
C  3.053523 0.949303 -1.911193
C  3.278806 0.576277 -0.4839
C  1.967475 0.198675 -1.161248
C  2.885704 2.41016 -2.254096
C  3.736994 0.169416 -3.010261
C  4.222402 -0.472825 -0.046513
C  0.723577 0.842378 -0.69392
C  4.527712 -0.769406 1.219078
C  -1.630637 0.496024 -0.539465
C  5.522626 -1.842944 1.544643
C  3.925809 -0.093397 2.413336
C  -2.679713 0.023734 -1.537167
C  -2.031129 -0.133176 0.7744
C  -3.223216 -0.739183 0.692941
C  -3.74206 -0.648589 -0.685884
C  -1.162511 0.009006 1.971559
C  -4.032521 -1.380459 1.77412
C  -4.952745 -0.373095 2.402769
C  -6.265454 -0.341429 2.225433
H  3.166539 1.411554 0.199366
H  1.854335 -0.842319 -1.441021
H  2.264535 2.532177 -3.143437
H  2.436605 2.986782 -1.449805
H  3.861991 2.846132 -2.47358
H  3.20852 0.306597 -3.954777
H  4.761491 0.519071 -3.150544
H  3.774068 -0.901857 -2.815204
H  4.711061 -1.047189 -0.827223
H  -1.629787 1.5845 -0.438096
H  6.355821 -1.442849 2.128033
H  5.067588 -2.628662 2.153075
H  5.934723 -2.308105 0.650007
H  3.185889 0.662833 2.160559
H  3.435354 -0.827433 3.057789
H  4.698509 0.382811 3.022113
H  -2.260401 -0.707161 -2.231595
H  -3.10796 0.829198 -2.13388
H  -1.6185 -0.418191 2.86252
H  -0.941142 1.059588 2.166096
H  -0.2020 -0.48784 1.818629
H  -4.616345 -2.198051 1.347949
H  -3.377986 -1.815963 2.533289
H  -4.476191 0.388063 3.013619
H  -6.879998 0.419684 2.686507
H  -6.771709 -1.069507 1.604668
totalener: -965.40553850 hartree
nucrepener: 1784.29301176 hartree
electener: -2749.69855026 hartree
oneelecener: -4854.61650656 hartree
twoeener: 2104.91795630 hartree
kineticenergy: 961.03589794 hartree
xcener: -95.137489578795 hartree
chargesum: 0.0000000
charge: -0.275466 -0.395642 -0.328335 0.107411 -0.031489 -0.050341 -0.254259 -0.276704 -0.181275 0.309573 -0.022551 0.223742 -0.213577 -0.250425 -0.136635 -0.068162 -0.032640 0.217718 -0.238104 -0.127451 -0.151329 -0.193612 0.099346 0.078495 0.084995 0.101041 0.086766 0.092602 0.100383 0.073561 0.083733 0.098466 0.086207 0.084478 0.077189 0.081264 0.084151 0.090853 0.089268 0.086432 0.087926 0.117068 0.099899 0.092821 0.097397 0.104601 0.100168 0.090441
qa: -0.2755 -0.3956 -0.3283 0.1074 -0.0315 -0.0503 -0.2543 -0.2767 -0.1813 0.3096 -0.0226 0.2237 -0.2136 -0.2504 -0.1366 -0.0682 -0.0326 0.2177 -0.2381 -0.1275 -0.1513 -0.1936 0.0993 0.0785 0.0850 0.1010 0.0868 0.0926 0.1004 0.0736 0.0837 0.0985 0.0862 0.0845 0.0772 0.0813 0.0842 0.0909 0.0893 0.0864 0.0879 0.1171 0.0999 0.0928 0.0974 0.1046 0.1002 0.0904
va: 2.1221 2.0998 2.1702 3.8019 3.8281 3.8196 3.8997 3.9185 3.9158 4.2478 3.7765 3.7752 3.9423 3.9491 3.8813 3.7525 3.4076 4.1329 3.9447 3.8883 3.8419 3.9849 1.0229 1.0359 1.0026 1.0213 1.0014 1.0052 1.0002 1.0072 1.0167 1.0298 0.9976 0.9983 1.0116 1.0163 0.9988 1.0004 1.0318 1.0289 1.0067 1.0044 1.0020 1.0280 1.0028 1.0081 1.0071 1.0202
dispcorr: -0.022206662 hartree
energy: -965.427745164188
dipole: 21.30891 -19.84596 1.46295 -0.74620 0.63079 -0.11541 6.43532 -6.03043 0.40490
magnitude: 1.52232 au
magnitude: 3.86944 debye
