program: Orca
programVersion: 5.0.2
elementType: O O O C C C C C C C C C C C C C C C C C C C H H H H H H H H H H H H H H H H H H H H H H H H H H
charge: 0
multiplicity: 1
keywords: wb97x-d3
keywords: def2-TZVPP
keywords: def2/J RIJCOSX
keywords: DEFGRID2
keywords: scfconv7
keywords: smallprint printgap noloewdin
keywords: NOSOSCF
formula: C19H26O3
InChI: InChI=1/C19H26O3/c1-7-8-13-12(4)16(10-15(13)20)22-18(21)17-14(9-11(2)3)19(17,5)6/h7,9,14,16-17H,1,8,10H2,2-6H3
48 atoms
O  -0.577347 -0.205734 -0.921408
O  0.502726 1.755584 -1.057907
O  -5.080225 -1.1171 -1.249571
C  2.950487 -0.125845 -1.659868
C  2.998568 0.361941 -0.244198
C  1.731145 -0.275461 -0.767017
C  2.96974 0.889749 -2.774975
C  3.667618 -1.40711 -2.01204
C  3.778377 -0.323203 0.809784
C  0.522306 0.558761 -0.934227
C  4.837134 0.176006 1.450097
C  -1.857248 0.419028 -1.034999
C  5.53726 -0.611812 2.516271
C  5.42435 1.527778 1.178695
C  -2.807995 -0.469136 -1.826904
C  -2.498141 0.558897 0.325111
C  -3.727035 0.026223 0.355166
C  -4.037621 -0.596487 -0.944661
C  -1.782023 1.24402 1.430407
C  -4.688939 -0.022724 1.499301
C  -4.42096 -1.209257 2.377195
C  -4.096399 -1.140481 3.660681
H  2.927271 1.440681 -0.149044
H  1.52934 -1.290173 -0.440729
H  4.003133 1.103614 -3.054081
H  2.463964 0.504076 -3.662492
H  2.497468 1.830132 -2.502481
H  4.724514 -1.210654 -2.199917
H  3.612226 -2.154193 -1.221418
H  3.243708 -1.848473 -2.915571
H  3.448725 -1.321628 1.082656
H  -1.74154 1.403973 -1.494464
H  5.537608 -0.072633 3.466908
H  5.07133 -1.582188 2.683399
H  6.584803 -0.782395 2.255382
H  4.905713 2.077399 0.396353
H  5.41902 2.143055 2.081755
H  6.469815 1.434712 0.874531
H  -2.377199 -1.459667 -1.987092
H  -3.068303 -0.067736 -2.806407
H  -2.422626 1.40363 2.295031
H  -1.383284 2.205249 1.103572
H  -0.930737 0.646166 1.763591
H  -4.637387 0.895731 2.087712
H  -5.703567 -0.089522 1.097082
H  -4.498771 -2.179313 1.896518
H  -3.909117 -2.029907 4.246397
H  -4.011071 -0.192587 4.178733
totalener: -965.40688433 hartree
nucrepener: 1776.99186879 hartree
electener: -2742.39875312 hartree
oneelecener: -4839.96090303 hartree
twoeener: 2097.56214991 hartree
kineticenergy: 961.04429527 hartree
xcener: -95.138577643374 hartree
chargesum: -0.0000000
charge: -0.274875 -0.391724 -0.330402 0.127123 0.015273 -0.138013 -0.271361 -0.233291 -0.197797 0.331391 -0.033211 0.228523 -0.208627 -0.237096 -0.139267 -0.079227 -0.039043 0.222315 -0.230875 -0.118645 -0.141268 -0.217434 0.095709 0.074114 0.085576 0.085829 0.102301 0.090027 0.073131 0.091597 0.080159 0.098847 0.085690 0.077766 0.084663 0.082454 0.088341 0.085612 0.088831 0.087280 0.084371 0.119855 0.102898 0.087740 0.103767 0.120938 0.102806 0.077230
qa: -0.2749 -0.3917 -0.3304 0.1271 0.0153 -0.1380 -0.2714 -0.2333 -0.1978 0.3314 -0.0332 0.2285 -0.2086 -0.2371 -0.1393 -0.0792 -0.0390 0.2223 -0.2309 -0.1186 -0.1413 -0.2174 0.0957 0.0741 0.0856 0.0858 0.1023 0.0900 0.0731 0.0916 0.0802 0.0988 0.0857 0.0778 0.0847 0.0825 0.0883 0.0856 0.0888 0.0873 0.0844 0.1199 0.1029 0.0877 0.1038 0.1209 0.1028 0.0772
va: 2.1229 2.1062 2.1683 3.7171 3.7689 3.9394 3.9133 3.9073 3.8938 4.2388 3.7821 3.7446 3.9386 3.9492 3.8712 3.7867 3.3914 4.1279 3.9370 3.8968 3.8357 3.9608 1.0313 1.0419 1.0019 1.0028 1.0204 1.0059 1.0095 1.0050 1.0181 1.0294 0.9981 1.0117 0.9985 1.0130 0.9996 0.9998 1.0328 1.0283 1.0107 1.0085 1.0027 1.0033 1.0240 1.0102 1.0105 1.0154
dispcorr: -0.022069734 hartree
energy: -965.428954059981
dipole: 25.99830 -24.49445 1.50385 0.54538 -0.41323 0.13215 8.59855 -8.07575 0.52280
magnitude: 1.59761 au
magnitude: 4.06080 debye
