program: Orca
programVersion: 5.0.2
elementType: O O O C C C C C C C C C C C C C C C C C C C H H H H H H H H H H H H H H H H H H H H H H H H H H
charge: 0
multiplicity: 1
keywords: wb97x-d3
keywords: def2-TZVPP
keywords: def2/J RIJCOSX
keywords: DEFGRID2
keywords: scfconv7
keywords: smallprint printgap noloewdin
keywords: NOSOSCF
formula: C19H26O3
InChI: InChI=1/C19H26O3/c1-7-8-13-12(4)16(10-15(13)20)22-18(21)17-14(9-11(2)3)19(17,5)6/h7,9,14,16-17H,1,8,10H2,2-6H3
48 atoms
O  -0.502303 -0.12421 -1.010783
O  0.51371 1.870915 -0.887356
O  -5.057929 -0.957414 -1.233077
C  2.985423 0.242187 -1.920242
C  3.08609 0.468679 -0.445354
C  1.814607 -0.129448 -1.028385
C  2.912621 1.447368 -2.826259
C  3.715848 -0.917955 -2.555718
C  3.945377 -0.333404 0.442274
C  0.57481 0.671578 -0.97145
C  4.466619 0.051587 1.610201
C  -1.798147 0.471968 -0.943678
C  5.346529 -0.873699 2.397015
C  4.249205 1.388713 2.251582
C  -2.786346 -0.303932 -1.80372
C  -2.360379 0.39458 0.455318
C  -3.600097 -0.114044 0.464483
C  -3.985655 -0.522414 -0.898665
C  -1.574983 0.884825 1.616078
C  -4.51151 -0.310783 1.63427
C  -4.184392 -1.573747 2.373892
C  -3.821876 -1.630219 3.647766
H  2.963463 1.507739 -0.161524
H  1.667149 -1.193823 -0.884252
H  3.922056 1.747504 -3.112955
H  2.367181 1.213225 -3.742685
H  2.431452 2.302506 -2.359211
H  4.764413 -0.665535 -2.722765
H  3.68571 -1.826289 -1.955354
H  3.273175 -1.157104 -3.523888
H  4.175012 -1.339806 0.106385
H  -1.731049 1.518326 -1.252887
H  4.925517 -1.071269 3.386139
H  5.490296 -1.830799 1.897011
H  6.332259 -0.431365 2.562039
H  5.199485 1.909277 2.391109
H  3.591247 2.046739 1.689648
H  3.815849 1.266537 3.247072
H  -2.374632 -1.275185 -2.087012
H  -3.070842 0.209401 -2.722205
H  -0.716099 0.23461 1.796722
H  -2.165428 0.901945 2.529459
H  -1.180716 1.884518 1.429178
H  -4.458004 0.543115 2.313362
H  -5.5397 -0.360641 1.265238
H  -4.251419 -2.490256 1.796035
H  -3.592439 -2.569914 4.130988
H  -3.744154 -0.739211 4.259521
totalener: -965.40701015 hartree
nucrepener: 1783.30942376 hartree
electener: -2748.71643390 hartree
oneelecener: -4852.55875680 hartree
twoeener: 2103.84232289 hartree
kineticenergy: 961.04324824 hartree
xcener: -95.139987431150 hartree
chargesum: -0.0000000
charge: -0.276792 -0.395917 -0.330254 0.086668 0.022843 -0.077492 -0.255080 -0.265567 -0.185616 0.325315 -0.043826 0.229277 -0.204382 -0.240731 -0.134272 -0.077133 -0.038856 0.219474 -0.231075 -0.119247 -0.140836 -0.219212 0.094425 0.074523 0.086902 0.083892 0.100076 0.098193 0.074579 0.091362 0.073417 0.098017 0.084364 0.076433 0.084686 0.087762 0.084859 0.084583 0.087793 0.086464 0.102857 0.083960 0.119991 0.089139 0.103779 0.119504 0.103117 0.078034
qa: -0.2768 -0.3959 -0.3303 0.0867 0.0228 -0.0775 -0.2551 -0.2656 -0.1856 0.3253 -0.0438 0.2293 -0.2044 -0.2407 -0.1343 -0.0771 -0.0389 0.2195 -0.2311 -0.1192 -0.1408 -0.2192 0.0944 0.0745 0.0869 0.0839 0.1001 0.0982 0.0746 0.0914 0.0734 0.0980 0.0844 0.0764 0.0847 0.0878 0.0849 0.0846 0.0878 0.0865 0.1029 0.0840 0.1200 0.0891 0.1038 0.1195 0.1031 0.0780
va: 2.1235 2.1029 2.1688 3.7583 3.8004 3.8318 3.9106 3.9185 3.9172 4.2543 3.8200 3.7517 3.9352 3.9439 3.8709 3.7817 3.3904 4.1273 3.9362 3.8916 3.8354 3.9581 1.0280 1.0372 1.0009 1.0028 1.0216 1.0016 1.0097 1.0045 1.0216 1.0301 0.9985 1.0121 0.9980 0.9989 1.0162 0.9993 1.0320 1.0293 1.0029 1.0118 1.0090 1.0030 1.0257 1.0099 1.0108 1.0151
dispcorr: -0.021880480 hartree
energy: -965.428890625433
dipole: 24.19370 -22.71625 1.47746 -0.05448 0.08173 0.02725 9.40837 -8.88712 0.52125
magnitude: 1.56695 au
magnitude: 3.98287 debye
