program: Orca
programVersion: 5.0.2
elementType: O O O C C C C C C C C C C C C C C C C C C C H H H H H H H H H H H H H H H H H H H H H H H H H H
charge: 0
multiplicity: 1
keywords: wb97x-d3
keywords: def2-TZVPP
keywords: def2/J RIJCOSX
keywords: DEFGRID2
keywords: scfconv7
keywords: smallprint printgap noloewdin
keywords: NOSOSCF
formula: C19H26O3
InChI: InChI=1/C19H26O3/c1-7-8-13-12(4)16(10-15(13)20)22-18(21)17-14(9-11(2)3)19(17,5)6/h7,9,14,16-17H,1,8,10H2,2-6H3
48 atoms
O  -0.475234 -0.115252 -1.075269
O  0.509743 1.898288 -0.997239
O  -5.018845 -1.030859 -1.158862
C  3.020569 0.313544 -1.993404
C  3.095592 0.525912 -0.517643
C  1.839214 -0.083535 -1.127409
C  2.947449 1.52482 -2.891417
C  3.77188 -0.834068 -2.627681
C  3.947869 -0.270821 0.38445
C  0.588703 0.698812 -1.06711
C  4.212098 0.006074 1.663668
C  -1.778691 0.458784 -0.975221
C  5.123746 -0.872278 2.466438
C  3.65018 1.175324 2.414722
C  -2.777485 -0.340492 -1.80063
C  -2.296557 0.37854 0.440724
C  -3.523403 -0.1581 0.491666
C  -3.944149 -0.577656 -0.858276
C  -1.487159 0.895132 1.573493
C  -4.390499 -0.369811 1.692654
C  -3.973586 -1.588134 2.46141
C  -3.579972 -1.584394 3.727387
H  2.953927 1.560856 -0.226085
H  1.707393 -1.150941 -0.992602
H  2.460017 2.374697 -2.421245
H  3.957311 1.830791 -3.170705
H  2.407911 1.294838 -3.812255
H  4.818696 -0.567919 -2.784699
H  3.746008 -1.745654 -2.031779
H  3.341327 -1.073527 -3.601125
H  4.404655 -1.161067 -0.036125
H  -1.739427 1.50413 -1.292594
H  5.502858 -1.711821 1.884965
H  5.982936 -0.309575 2.840289
H  4.610623 -1.275059 3.343328
H  3.13943 0.835631 3.318888
H  4.448262 1.844996 2.745046
H  2.937389 1.763289 1.840976
H  -2.355831 -1.305209 -2.091606
H  -3.099591 0.162222 -2.712491
H  -1.128308 1.904944 1.369806
H  -0.604422 0.27042 1.727614
H  -2.047012 0.899643 2.50597
H  -4.367554 0.506974 2.343989
H  -5.4237 -0.487702 1.354375
H  -3.9991 -2.524824 1.913391
H  -3.285813 -2.493659 4.233132
H  -3.542343 -0.6717 4.310491
totalener: -965.40655424 hartree
nucrepener: 1792.02032045 hartree
electener: -2757.42687469 hartree
oneelecener: -4869.97132216 hartree
twoeener: 2112.54444747 hartree
kineticenergy: 961.04385599 hartree
xcener: -95.139845829231 hartree
chargesum: -0.0000000
charge: -0.276947 -0.396911 -0.329809 0.101445 -0.014725 -0.057047 -0.252778 -0.275205 -0.181470 0.315516 -0.027991 0.227288 -0.211180 -0.248256 -0.135224 -0.074031 -0.041712 0.219828 -0.231214 -0.118323 -0.140525 -0.220059 0.097790 0.077353 0.100571 0.085894 0.084255 0.100123 0.073676 0.092650 0.078791 0.098939 0.077244 0.085739 0.084086 0.084009 0.090970 0.082378 0.088038 0.086579 0.119916 0.101885 0.084318 0.089696 0.104198 0.118545 0.103156 0.078532
qa: -0.2769 -0.3969 -0.3298 0.1014 -0.0147 -0.0570 -0.2528 -0.2752 -0.1815 0.3155 -0.0280 0.2273 -0.2112 -0.2483 -0.1352 -0.0740 -0.0417 0.2198 -0.2312 -0.1183 -0.1405 -0.2201 0.0978 0.0774 0.1006 0.0859 0.0843 0.1001 0.0737 0.0927 0.0788 0.0989 0.0772 0.0857 0.0841 0.0840 0.0910 0.0824 0.0880 0.0866 0.1199 0.1019 0.0843 0.0897 0.1042 0.1185 0.1032 0.0785
va: 2.1233 2.1003 2.1699 3.7899 3.8212 3.8211 3.9035 3.9188 3.9208 4.2493 3.7891 3.7583 3.9404 3.9475 3.8718 3.7728 3.3947 4.1258 3.9360 3.8880 3.8339 3.9565 1.0245 1.0364 1.0213 1.0012 1.0027 1.0006 1.0080 1.0046 1.0187 1.0297 1.0117 0.9973 0.9986 0.9994 0.9994 1.0159 1.0318 1.0293 1.0088 1.0029 1.0127 1.0032 1.0266 1.0099 1.0110 1.0150
dispcorr: -0.022192638 hartree
energy: -965.428746880227
dipole: 23.32391 -21.86680 1.45712 -0.04422 0.07151 0.02729 9.81985 -9.29405 0.52581
magnitude: 1.54932 au
magnitude: 3.93807 debye
