program: Orca
programVersion: 5.0.2
elementType: O O O C C C C C C C C C C C C C C C C C C C H H H H H H H H H H H H H H H H H H H H H H H H H H
charge: 0
multiplicity: 1
keywords: wb97x-d3
keywords: def2-TZVPP
keywords: def2/J RIJCOSX
keywords: DEFGRID2
keywords: scfconv7
keywords: smallprint printgap noloewdin
keywords: NOSOSCF
formula: C19H26O3
InChI: InChI=1/C19H26O3/c1-7-8-13-12(4)16(10-15(13)20)22-18(21)17-14(9-11(2)3)19(17,5)6/h7,9,14,16-17H,1,8,10H2,2-6H3
48 atoms
O  -0.394379 -0.306836 -1.719702
O  -0.177081 -0.152678 0.500696
O  -3.858019 -2.548233 0.573643
C  2.377857 1.493783 -0.34027
C  2.767569 0.130459 0.144934
C  1.700852 0.264146 -0.924481
C  1.632934 2.407831 0.601172
C  3.2997 2.241168 -1.273655
C  4.056612 -0.499223 -0.20374
C  0.304037 -0.080038 -0.604756
C  4.902147 -1.10574 0.635999
C  -1.776735 -0.656359 -1.629906
C  6.180965 -1.705087 0.131349
C  4.691128 -1.248184 2.112311
C  -2.084969 -2.006992 -0.991268
C  -2.617149 0.338148 -0.87196
C  -3.482966 -0.272072 -0.047851
C  -3.238603 -1.717082 -0.057716
C  -2.474392 1.795985 -1.10303
C  -4.495336 0.376486 0.842159
C  -3.835408 0.938055 2.067063
C  -3.828403 2.223043 2.398714
H  2.373252 -0.113368 1.125629
H  2.001917 0.022806 -1.938101
H  0.96701 3.077927 0.052557
H  1.040084 1.87629 1.342463
H  2.346618 3.031715 1.143336
H  2.751623 3.017557 -1.811172
H  4.097344 2.730197 -0.710394
H  3.766776 1.597634 -2.018153
H  4.334906 -0.461331 -1.253071
H  -2.093984 -0.649101 -2.67531
H  6.228786 -2.77479 0.353116
H  6.299621 -1.580703 -0.945185
H  7.047641 -1.251266 0.619834
H  4.713673 -2.301257 2.405074
H  5.500852 -0.760944 2.66211
H  3.753868 -0.825773 2.468988
H  -1.245845 -2.41427 -0.424509
H  -2.368435 -2.762469 -1.725381
H  -3.412386 2.32522 -0.937284
H  -2.129156 2.013214 -2.114129
H  -1.740772 2.220139 -0.41146
H  -5.023534 1.169552 0.307593
H  -5.244465 -0.365268 1.133227
H  -3.319354 0.220719 2.699014
H  -3.325811 2.571729 3.292211
H  -4.330482 2.973272 1.798238
elementType: O C H
totalener: -965.42675032 hartree
nucrepener: 1824.92191776 hartree
electener: -2790.34866808 hartree
oneelecener: -4936.58104538 hartree
twoeener: 2146.23237730 hartree
cpcmener: -0.03060137 hartree
kineticenergy: 960.99689642 hartree
xcener: -95.140226588359 hartree
chargesum: -0.0000000
charge: -0.296371 -0.464379 -0.455804 0.111815 0.038797 -0.104820 -0.285376 -0.270560 -0.279491 0.387468 -0.049770 0.285701 -0.217145 -0.250196 -0.149227 -0.000037 -0.118919 0.281075 -0.286837 -0.101589 -0.174055 -0.286670 0.094322 0.086057 0.094485 0.095020 0.100565 0.096409 0.097740 0.088010 0.117166 0.116814 0.093137 0.087375 0.092024 0.094824 0.095614 0.089535 0.110987 0.105894 0.113333 0.119157 0.116900 0.103505 0.094096 0.142138 0.129570 0.111713
qa: -0.2964 -0.4644 -0.4558 0.1118 0.0388 -0.1048 -0.2854 -0.2706 -0.2795 0.3875 -0.0498 0.2857 -0.2171 -0.2502 -0.1492 -0.0000 -0.1189 0.2811 -0.2868 -0.1016 -0.1741 -0.2867 0.0943 0.0861 0.0945 0.0950 0.1006 0.0964 0.0977 0.0880 0.1172 0.1168 0.0931 0.0874 0.0920 0.0948 0.0956 0.0895 0.1110 0.1059 0.1133 0.1192 0.1169 0.1035 0.0941 0.1421 0.1296 0.1117
va: 2.1331 2.0444 2.0475 3.6777 3.7778 3.8531 3.9025 3.9085 3.8720 4.1823 3.7646 3.7719 3.9213 3.9414 3.8608 3.6555 3.4642 4.0788 3.9395 3.8695 3.7906 3.9396 1.0325 1.0388 0.9999 1.0184 1.0018 1.0022 1.0019 1.0064 1.0110 0.9912 0.9964 1.0089 0.9963 0.9971 0.9971 1.0107 1.0261 1.0229 0.9991 1.0059 0.9937 1.0077 1.0257 1.0023 1.0037 1.0099
dispcorr: -0.023530006 hartree
energy: -965.450280324836
dipole: 21.39712 -19.88729 1.50983 11.79552 -10.11918 1.67633 3.76899 -5.53484 -1.76585
magnitude: 2.86494 au
magnitude: 7.28211 debye
