program: Orca
programVersion: 5.0.2
elementType: O O O C C C C C C C C C C C C C C C C C C C H H H H H H H H H H H H H H H H H H H H H H H H H H
charge: 0
multiplicity: 1
keywords: wb97x-d3
keywords: def2-TZVPP
keywords: def2/J RIJCOSX
keywords: DEFGRID2
keywords: scfconv7
keywords: smallprint printgap noloewdin
keywords: NOSOSCF
formula: C19H26O3
InChI: InChI=1/C19H26O3/c1-7-8-13-12(4)16(10-15(13)20)22-18(21)17-14(9-11(2)3)19(17,5)6/h7,9,14,16-17H,1,8,10H2,2-6H3
48 atoms
O  -0.462094 -0.059944 -1.021562
O  0.577401 1.924948 -1.061913
O  -4.990088 -0.972509 -0.940391
C  3.039484 0.233728 -1.995271
C  3.129079 0.45594 -0.521033
C  1.843649 -0.105916 -1.124535
C  3.024088 1.440004 -2.902575
C  3.729468 -0.955464 -2.621318
C  3.957809 -0.367583 0.379108
C  0.624317 0.717632 -1.07438
C  4.307365 -0.02854 1.624094
C  -1.756517 0.539086 -0.915511
C  5.220434 -0.897638 2.433162
C  3.860574 1.237075 2.30012
C  -2.781015 -0.288455 -1.677082
C  -2.233005 0.525875 0.515998
C  -3.45735 -0.013733 0.625788
C  -3.905858 -0.491711 -0.688703
C  -1.394066 1.088067 1.602262
C  -4.284987 -0.191189 1.859031
C  -3.896408 -1.446092 2.584883
C  -4.679511 -2.504861 2.746627
H  3.039346 1.498591 -0.234062
H  1.673335 -1.166728 -0.980195
H  4.042148 1.653876 -3.234863
H  2.421677 1.25678 -3.794761
H  2.646889 2.337798 -2.418714
H  4.790931 -0.750956 -2.77535
H  3.647625 -1.862521 -2.023222
H  3.290553 -1.173413 -3.596927
H  4.3256 -1.31025 -0.014045
H  -1.721738 1.566717 -1.284352
H  5.548996 -1.778911 1.881846
H  6.11164 -0.343773 2.742158
H  4.734603 -1.234201 3.352898
H  4.565243 2.054054 2.11946
H  2.878018 1.57497 1.970883
H  3.812986 1.101965 3.382106
H  -2.373544 -1.265326 -1.949947
H  -3.133951 0.187132 -2.592265
H  -0.503441 0.473543 1.759228
H  -1.928333 1.138594 2.549494
H  -1.044855 2.09118 1.351018
H  -4.151665 0.669222 2.520144
H  -5.342788 -0.224525 1.589956
H  -2.885844 -1.463628 2.984173
H  -4.332672 -3.385633 3.272648
H  -5.689933 -2.536751 2.354897
elementType: O C H
totalener: -965.42835143 hartree
nucrepener: 1787.90309514 hartree
electener: -2753.33144657 hartree
oneelecener: -4861.89658540 hartree
twoeener: 2108.56513883 hartree
cpcmener: -0.02864460 hartree
kineticenergy: 960.98787796 hartree
xcener: -95.135896974612 hartree
chargesum: -0.0000000
charge: -0.294021 -0.472617 -0.446824 0.111979 -0.007493 -0.063045 -0.274691 -0.293248 -0.274340 0.376612 -0.007811 0.258247 -0.223746 -0.281833 -0.136739 -0.037215 -0.070202 0.280853 -0.255434 -0.098340 -0.182279 -0.276132 0.100963 0.089717 0.095212 0.096906 0.093008 0.102711 0.089538 0.098304 0.114796 0.103185 0.086173 0.096630 0.092871 0.107898 0.092093 0.095123 0.100570 0.098095 0.114334 0.104565 0.116325 0.111884 0.086416 0.139397 0.128944 0.112661
qa: -0.2940 -0.4726 -0.4468 0.1120 -0.0075 -0.0630 -0.2747 -0.2932 -0.2743 0.3766 -0.0078 0.2582 -0.2237 -0.2818 -0.1367 -0.0372 -0.0702 0.2809 -0.2554 -0.0983 -0.1823 -0.2761 0.1010 0.0897 0.0952 0.0969 0.0930 0.1027 0.0895 0.0983 0.1148 0.1032 0.0862 0.0966 0.0929 0.1079 0.0921 0.0951 0.1006 0.0981 0.1143 0.1046 0.1163 0.1119 0.0864 0.1394 0.1289 0.1127
va: 2.1250 2.0315 2.0550 3.7405 3.8120 3.8035 3.8956 3.9195 3.9200 4.1939 3.7093 3.7478 3.9289 3.9455 3.9020 3.7538 3.4369 4.0764 3.9345 3.8608 3.8028 3.9565 1.0218 1.0351 1.0001 0.9997 1.0195 0.9994 1.0046 1.0014 1.0109 1.0314 1.0091 0.9930 0.9957 0.9944 1.0030 1.0008 1.0291 1.0251 0.9971 1.0035 1.0085 1.0027 1.0281 0.9996 1.0024 1.0123
dispcorr: -0.022111851 hartree
energy: -965.450463285958
dipole: 22.93244 -20.85856 2.07388 -0.88224 1.04002 0.15778 8.45910 -7.70491 0.75420
magnitude: 2.21240 au
magnitude: 5.62346 debye
