program: Gaussian 09
title: 000060654
version: EM64L-G09RevD.01
frameworkgroup: C1[X(C19H20N2O3)]
method: RPBEPBE
basis: SDD
operation: Freq
keyword: #p
keyword: freq=noraman
keyword: PBEPBE/SDD
title: #p freq=noraman PBEPBE/SDD
converged: NO YES NO NO
title: Mulliken charges:
elementType: O O O N N C C C C C C C C C C C C C C C C C C C H H H H H H H H H H H H H H H H H H H H
charge: -0.307543 -0.185655 -0.272479 -0.033499 -0.403343 -0.117314 -0.127174 -0.227505 -0.503682 -0.510612 -0.526435 -0.502560 0.048278 -0.540466 0.120171 0.183531 0.112201 0.170170 -0.334246 0.238737 -0.387476 -0.355900 -0.239864 -0.212511 0.239074 0.238659 0.266307 0.233927 0.232883 0.245266 0.234577 0.228632 0.217488 0.242510 0.224467 0.237748 0.257826 0.256971 0.284345 0.314429 0.279370 0.230563 0.225404 0.224730
chargesum: 0.00000
title: Mulliken charges with hydrogens summed into heavy atoms:
elementType: O O O N N C C C C C C C C C C C C C C C C C C C
charge: -0.307543 -0.185655 -0.272479 -0.033499 -0.088914 0.121760 0.111484 0.038802 -0.036872 -0.030768 -0.080316 -0.035583 0.286026 -0.025669 0.120171 0.183531 0.112201 0.170170 -0.049901 0.238737 -0.108106 -0.125337 -0.014461 0.012218
polarizability: 3.23745621e+02 -7.40882758e+00 2.11519085e+02 2.87541392e+00 2.62458302e+00 1.34904046e+02
1716.lowfreq: -0.0007 -0.0005 -0.0002 6.0055 7.4989 20.0219 27.9841 34.9987 37.6010
frequency: 27.9307 33.4281 37.0965 68.5595 83.5240 98.5445 128.6670 155.7769 187.2551 192.5915 224.2280 272.3509 291.2994 307.8949 314.8811 347.3046 363.3364 374.9309 398.0709 426.2938 430.5804 446.6858 482.0818 494.8080 516.9494 567.1627 568.9869 571.4091 574.4793 588.8621 594.1249 612.6010 628.4338 684.4763 709.4817 714.0149 729.0360 758.8735 759.5247 767.8508 776.2600 791.5202 799.0809 850.9021 855.5903 865.7106 868.2463 870.0953 898.5886 904.7208 926.9022 944.0435 946.8915 948.7306 987.7654 993.7474 1012.0308 1012.8738 1032.0307 1039.5400 1073.1256 1079.5744 1084.4178 1091.4386 1113.5344 1121.6754 1125.1739 1129.1560 1148.7184 1164.5611 1165.3240 1169.3887 1202.6679 1229.0535 1243.9846 1246.8830 1251.3853 1259.9749 1269.4974 1279.0092 1287.1616 1294.0777 1294.5830 1310.4598 1314.8672 1324.8875 1327.1660 1331.4822 1348.2706 1358.3095 1361.6658 1371.8022 1394.4052 1418.7684 1425.5915 1451.9305 1454.9153 1466.5680 1472.1170 1485.1151 1486.2204 1522.7507 1590.0460 1622.1476 1636.5661 1649.1475 2986.5315 2992.2601 2993.5520 2999.0415 3001.1660 3012.7155 3015.0911 3017.7543 3047.3888 3053.5004 3056.4362 3066.6381 3068.5460 3076.3147 3129.0120 3141.1610 3159.4759 3177.3329 3246.4248 3601.6060
redmass: 6.7436 4.0962 5.9873 7.5067 6.3930 6.5220 5.4448 6.1111 2.6828 5.6235 4.0504 3.8725 3.8585 2.0627 4.2359 2.9502 3.5379 2.9525 6.9182 2.9306 4.9849 2.1830 4.6529 4.7444 6.6359 1.8342 2.1348 6.8955 3.1475 5.4842 3.8240 2.0614 6.6478 3.9170 4.3167 4.8110 3.2110 1.3956 5.9750 5.2499 3.8718 3.0041 3.0678 1.4659 1.5842 1.4424 4.9606 3.2598 1.8452 2.7840 3.1584 1.9711 1.3705 2.9697 1.3053 7.9290 2.0682 2.0348 2.6491 2.2967 2.0970 2.0710 2.8546 1.9542 2.6191 1.6705 1.5085 1.8696 1.7834 1.4186 1.2461 1.1824 1.4236 1.8149 1.6742 1.6905 2.5132 1.4051 1.2665 1.4338 1.5946 1.9568 1.5733 1.3322 1.4077 1.3111 1.3680 1.3383 1.6621 1.9180 1.4962 1.5016 5.3814 1.0824 2.4856 1.0884 3.8821 1.0957 1.0774 1.1364 2.7533 5.7876 6.4461 11.0299 7.2009 10.5939 1.0598 1.0620 1.0617 1.0689 1.0727 1.0772 1.0830 1.0757 1.1020 1.1024 1.1020 1.0881 1.1029 1.1034 1.0857 1.0910 1.0968 1.0975 1.0990 1.0811
irintensity: 0.5349 0.8521 0.4575 5.5114 3.4313 0.7296 0.1565 0.4490 1.4343 4.6402 10.1858 1.0712 6.5347 0.1525 0.7310 2.7370 5.2783 8.1619 0.5349 12.6917 21.5020 3.9300 3.5192 0.9903 0.6345 39.0133 11.2059 6.7012 5.2477 2.5589 1.3839 47.9994 3.9612 12.2407 4.0316 0.7168 6.5460 108.7725 7.0071 14.9763 13.5359 6.9040 5.8285 9.3901 0.1410 0.6036 3.3839 5.0570 3.9460 0.3880 12.1446 1.8190 4.0157 7.1866 0.4220 505.0635 5.5415 0.9618 43.7201 11.1997 43.9877 12.9332 38.1567 48.6728 25.7704 156.4709 25.6979 11.1828 121.1882 0.6597 3.1549 19.5199 0.5606 15.0747 60.1301 9.5377 15.1581 4.5092 5.1218 11.0081 8.0262 56.9856 11.8550 0.8282 1.7764 2.2994 1.0342 3.8863 20.4160 3.2772 3.0597 12.7727 99.5583 24.3890 73.7982 7.5579 25.0347 9.0444 8.5721 14.9102 2.6712 85.7130 18.1986 235.5297 67.5121 202.5146 34.6723 25.0212 19.6773 2.5263 8.7563 52.5386 23.7678 34.3661 0.9171 49.6585 35.0841 28.9917 12.5510 20.8764 0.1882 18.5581 27.2815 10.3673 1.8821 74.7402
temp: 298.150 k
press: 1.00000 atm
elementType: 8 8 8 7 7 6 6 6 6 6 6 6 6 6 6 6 6 6 6 6 6 6 6 6 1 1 1 1 1 1 1 1 1 1 1 1 1 1 1 1 1 1 1 1
symmnumber: 1
zpe: 939972.8 jmol-1
zpe.correction: 0.358017 hartree
zpe.thermalcorrener: 0.377002 hartree
zpe.thermalcorrenthalpy: 0.377947 hartree
zpe.thermalcorrgfe: 0.309887 hartree
zpe.sumelectzpe: -1069.473573 hartree
zpe.sumelectthermal: -1069.454587 hartree
zpe.sumelectthermalent: -1069.453643 hartree
zpe.sumelectthermalfe: -1069.521703 hartree
dipole: -4.3725 -4.0682 -0.0288
dipole: 5.9724
quadrupole: -149.5566 -128.7475 -140.3909
quadrupole: 7.2520 1.8802 -2.1327
quadrupole: -9.9916 10.8175 -0.8259 7.2520 1.8802 -2.1327
hfenergy: -1069.8315895 hartree
pointgroup: C01 [X(C19H20N2O3)]
dipole: 1.7147505 1.5658823 -0.3589548 debye
polarizability: 323.8144949|-7.3125308|206.6008625|-0.553414|-18.8736956|139.7533942 unknown
InChI: InChI=1S/C19H20N2O3/c22-18-10-21-12-5-11(18)6-13(21)8-14(7-12)24-19(23)16-9-20-17-4-2-1-3-15(16)17/h1-4,9,11-14,20H,5-8,10H2
charge 0 multiplicity 1
44 atoms
O  0.335245 0.870443 -0.058371
O  -6.906392 -0.852429 0.278802
O  1.086256 -1.264461 0.558825
N  -3.790303 0.704311 -0.95253
N  4.356987 1.920638 -0.514542
C  -3.427502 1.309522 0.376797
C  -3.061792 -0.602045 -1.120225
C  -4.52425 -0.929806 0.954231
C  -3.867792 0.354078 1.55457
C  -3.492316 -1.621518 0.006619
C  -1.918876 1.650672 0.379846
C  -1.541107 -0.326815 -1.164342
C  -1.072925 0.400424 0.109648
C  -5.258168 0.471387 -1.012152
C  -5.715186 -0.49012 0.105195
C  1.343079 -0.085289 0.192327
C  2.676637 0.47036 -0.022317
C  3.941423 -0.236432 0.1292
C  2.979252 1.782032 -0.416976
C  4.982576 0.701033 -0.187415
C  4.2895 -1.561322 0.496164
C  6.351149 0.360486 -0.148684
C  5.654375 -1.90929 0.536161
C  6.672666 -0.962586 0.218702
H  -3.989889 2.259038 0.450329
H  -3.36261 -1.001641 -2.106623
H  -4.862512 -1.615901 1.748461
H  -4.579356 0.865247 2.228252
H  -3.00324 0.0493 2.174404
H  -2.623664 -1.951421 0.606847
H  -3.935988 -2.530452 -0.438618
H  -1.724241 2.390581 -0.418077
H  -1.63364 2.104385 1.346865
H  -0.988051 -1.275335 -1.283716
H  -1.32644 0.318932 -2.035957
H  -1.080649 -0.295005 0.969818
H  -5.533974 0.048277 -1.997188
H  -5.798622 1.432584 -0.914423
H  2.295734 2.601066 -0.626864
H  4.842701 2.774293 -0.783491
H  3.504269 -2.282709 0.738593
H  7.135746 1.085313 -0.392189
H  5.944234 -2.927933 0.816548
H  7.723855 -1.268492 0.260597
