program: Orca
programVersion: 5.0.2
elementType: O O O C C C C C C C C C C C C C C C C C C C H H H H H H H H H H H H H H H H H H H H H H H H H H
charge: 0
multiplicity: 1
keywords: wb97x-d3
keywords: def2-TZVPP
keywords: def2/J RIJCOSX
keywords: DEFGRID2
keywords: scfconv7
keywords: smallprint printgap noloewdin
keywords: NOSOSCF
formula: C19H26O3
InChI: InChI=1/C19H26O3/c1-7-8-13-12(4)16(10-15(13)20)22-18(21)17-14(9-11(2)3)19(17,5)6/h7,9,14,16-17H,1,8,10H2,2-6H3
48 atoms
O  -0.381399 -0.099331 -1.034993
O  0.505696 1.953856 -1.188859
O  -4.824677 -1.364463 -1.086255
C  3.075677 0.363978 -2.053909
C  3.17311 0.732824 -0.615677
C  1.922726 0.026886 -1.117818
C  2.945972 1.460854 -3.081415
C  3.845241 -0.832899 -2.559581
C  4.090794 0.049788 0.33098
C  0.643258 0.754739 -1.125434
C  3.886807 -0.060444 1.646192
C  -1.721229 0.398998 -0.997613
C  4.885578 -0.734732 2.535859
C  2.665938 0.463412 2.337867
C  -2.65106 -0.52784 -1.767401
C  -2.251112 0.393803 0.414094
C  -3.435832 -0.232609 0.498347
C  -3.793661 -0.787646 -0.812564
C  -1.505829 1.047785 1.516706
C  -4.292269 -0.399197 1.714907
C  -3.726957 -1.421731 2.655909
C  -3.399205 -1.181991 3.919446
H  3.010737 1.789652 -0.416583
H  1.835798 -1.024384 -0.86836
H  3.940075 1.754816 -3.42462
H  2.385955 1.121366 -3.95509
H  2.460657 2.35408 -2.695623
H  3.378313 -1.232748 -3.461767
H  4.869559 -0.554334 -2.816135
H  3.893353 -1.641995 -1.83058
H  5.006297 -0.361741 -0.084892
H  -1.751071 1.414897 -1.39821
H  5.256336 -0.04889 3.302233
H  4.433326 -1.575969 3.067974
H  5.743807 -1.111115 1.979086
H  2.941992 1.162731 3.131536
H  1.976456 0.976417 1.668892
H  2.120133 -0.350307 2.823418
H  -2.160447 -1.477273 -1.996521
H  -3.006088 -0.10693 -2.708235
H  -1.083535 2.00245 1.201351
H  -0.670569 0.418962 1.83809
H  -2.135035 1.220074 2.388046
H  -4.406294 0.556747 2.231504
H  -5.293442 -0.708232 1.401099
H  -3.582832 -2.417675 2.246825
H  -2.997543 -1.960226 4.556146
H  -3.52787 -0.20388 4.369514
elementType: O C H
totalener: -965.42771159 hartree
nucrepener: 1809.52307674 hartree
electener: -2774.95078833 hartree
oneelecener: -4905.00536638 hartree
twoeener: 2130.05457805 hartree
cpcmener: -0.02696037 hartree
kineticenergy: 960.98901291 hartree
xcener: -95.136118750880 hartree
chargesum: 0.0000000
charge: -0.290239 -0.472416 -0.450125 0.154507 -0.029260 -0.099385 -0.277741 -0.290788 -0.287121 0.378703 -0.008707 0.253495 -0.228848 -0.236935 -0.135196 -0.026945 -0.076573 0.289121 -0.279157 -0.090263 -0.182571 -0.282922 0.103215 0.089757 0.094621 0.098330 0.093005 0.097795 0.099158 0.092260 0.122055 0.102260 0.095252 0.094069 0.089349 0.101193 0.069678 0.099926 0.099965 0.098132 0.119431 0.119611 0.107073 0.104516 0.093704 0.142640 0.129517 0.112854
qa: -0.2902 -0.4724 -0.4501 0.1545 -0.0293 -0.0994 -0.2777 -0.2908 -0.2871 0.3787 -0.0087 0.2535 -0.2288 -0.2369 -0.1352 -0.0269 -0.0766 0.2891 -0.2792 -0.0903 -0.1826 -0.2829 0.1032 0.0898 0.0946 0.0983 0.0930 0.0978 0.0992 0.0923 0.1221 0.1023 0.0953 0.0941 0.0893 0.1012 0.0697 0.0999 0.1000 0.0981 0.1194 0.1196 0.1071 0.1045 0.0937 0.1426 0.1295 0.1129
va: 2.1217 2.0291 2.0547 3.6998 3.8245 3.8092 3.8890 3.9136 3.8895 4.1725 3.7020 3.7550 3.9307 3.9430 3.9042 3.7087 3.4523 4.0661 3.9215 3.8535 3.8007 3.9364 1.0262 1.0347 1.0009 0.9996 1.0193 1.0029 0.9993 1.0013 1.0030 1.0317 0.9961 0.9966 1.0064 1.0002 1.0137 0.9974 1.0285 1.0249 1.0131 0.9957 1.0054 1.0047 1.0269 1.0020 1.0041 1.0096
dispcorr: -0.023379166 hartree
energy: -965.451090757263
dipole: 21.17213 -19.32874 1.84339 -0.15760 0.27807 0.12046 9.93041 -9.11208 0.81833
magnitude: 2.02046 au
magnitude: 5.13561 debye
