program: Orca
programVersion: 5.0.2
elementType: O O O C C C C C C C C C C C C C C C C C C C H H H H H H H H H H H H H H H H H H H H H H H H H H
charge: 0
multiplicity: 1
keywords: wb97x-d3
keywords: def2-TZVPP
keywords: def2/J RIJCOSX
keywords: DEFGRID2
keywords: scfconv7
keywords: smallprint printgap noloewdin
keywords: NOSOSCF
formula: C19H26O3
InChI: InChI=1/C19H26O3/c1-7-8-13-12(4)16(10-15(13)20)22-18(21)17-14(9-11(2)3)19(17,5)6/h7,9,14,16-17H,1,8,10H2,2-6H3
48 atoms
O  -0.345617 0.070285 -0.972212
O  0.637269 1.910935 -0.155778
O  -4.895127 -0.853445 -1.080341
C  3.05758 0.934203 -1.902555
C  3.266249 0.558791 -0.47315
C  1.95622 0.19033 -1.165036
C  2.902379 2.39457 -2.251763
C  3.743488 0.147806 -2.994751
C  4.196834 -0.499498 -0.028967
C  0.715404 0.840228 -0.711153
C  4.543754 -0.745583 1.239148
C  -1.641692 0.49405 -0.544178
C  5.531185 -1.821999 1.575239
C  4.010882 0.00458 2.422695
C  -2.700837 0.072319 -1.551113
C  -2.035601 -0.186939 0.744857
C  -3.255854 -0.740115 0.654303
C  -3.782614 -0.552608 -0.703615
C  -1.148929 -0.131737 1.931884
C  -4.075402 -1.386142 1.725241
C  -4.964822 -0.369282 2.379553
C  -6.287566 -0.341778 2.278377
H  3.159181 1.392297 0.212966
H  1.841946 -0.849096 -1.45109
H  2.249217 2.522719 -3.117544
H  2.502827 2.994116 -1.436987
H  3.877128 2.811405 -2.514193
H  3.237647 0.306833 -3.949001
H  4.778811 0.474875 -3.112399
H  3.751874 -0.925901 -2.809384
H  4.638111 -1.121448 -0.801841
H  -1.649037 1.576991 -0.399865
H  6.374554 -1.418068 2.142459
H  5.076619 -2.588897 2.208551
H  5.929502 -2.312492 0.686885
H  3.149555 0.63007 2.194368
H  3.710129 -0.690503 3.210395
H  4.782541 0.645669 2.858567
H  -2.313718 -0.682349 -2.240966
H  -3.086006 0.897638 -2.150252
H  -1.569768 -0.658676 2.785965
H  -0.968565 0.904245 2.227894
H  -0.172372 -0.571945 1.7168
H  -4.677728 -2.189618 1.296132
H  -3.422316 -1.842035 2.473271
H  -4.457641 0.401432 2.953584
H  -6.873837 0.425751 2.767872
H  -6.834443 -1.08673 1.711821
elementType: O C H
totalener: -965.42878719 hartree
nucrepener: 1782.18412012 hartree
electener: -2747.61290731 hartree
oneelecener: -4850.51891548 hartree
twoeener: 2102.90600818 hartree
cpcmener: -0.02927778 hartree
kineticenergy: 960.98294182 hartree
xcener: -95.135636035473 hartree
chargesum: 0.0000000
charge: -0.293466 -0.472909 -0.448752 0.120454 -0.024435 -0.057700 -0.274024 -0.294232 -0.262980 0.371745 -0.015928 0.251087 -0.228926 -0.266470 -0.131917 -0.039161 -0.067577 0.279403 -0.245830 -0.107185 -0.177826 -0.276196 0.100899 0.090406 0.097572 0.093104 0.095906 0.097960 0.103750 0.089693 0.117783 0.103790 0.093708 0.094065 0.087752 0.086102 0.093665 0.103089 0.100636 0.097317 0.102718 0.115871 0.110785 0.095044 0.110751 0.140278 0.128601 0.111582
qa: -0.2935 -0.4729 -0.4488 0.1205 -0.0244 -0.0577 -0.2740 -0.2942 -0.2630 0.3717 -0.0159 0.2511 -0.2289 -0.2665 -0.1319 -0.0392 -0.0676 0.2794 -0.2458 -0.1072 -0.1778 -0.2762 0.1009 0.0904 0.0976 0.0931 0.0959 0.0980 0.1038 0.0897 0.1178 0.1038 0.0937 0.0941 0.0878 0.0861 0.0937 0.1031 0.1006 0.0973 0.1027 0.1159 0.1108 0.0950 0.1108 0.1403 0.1286 0.1116
va: 2.1257 2.0287 2.0507 3.7566 3.8138 3.8027 3.8935 3.9173 3.9068 4.1952 3.7219 3.7662 3.9305 3.9454 3.9161 3.7648 3.4374 4.0810 3.9378 3.8652 3.7875 3.9567 1.0220 1.0345 0.9997 1.0193 1.0002 1.0018 0.9989 1.0037 1.0097 1.0315 0.9946 0.9963 1.0084 1.0115 0.9979 0.9965 1.0280 1.0258 1.0055 1.0021 1.0003 1.0217 1.0040 1.0002 1.0031 1.0137
dispcorr: -0.022149914 hartree
energy: -965.450937099659
dipole: 21.70532 -19.51562 2.18970 -1.15312 0.80074 -0.35238 6.66916 -6.05662 0.61253
magnitude: 2.30091 au
magnitude: 5.84844 debye
