program: Orca
programVersion: 5.0.2
elementType: O O O C C C C C C C C C C C C C C C C C C C H H H H H H H H H H H H H H H H H H H H H H H H H H
charge: 0
multiplicity: 1
keywords: wb97x-d3
keywords: def2-TZVPP
keywords: def2/J RIJCOSX
keywords: DEFGRID2
keywords: scfconv7
keywords: smallprint printgap noloewdin
keywords: NOSOSCF
formula: C19H26O3
InChI: InChI=1/C19H26O3/c1-7-8-13-12(4)16(10-15(13)20)22-18(21)17-14(9-11(2)3)19(17,5)6/h7,9,14,16-17H,1,8,10H2,2-6H3
48 atoms
O  -0.572491 -0.132992 -0.228224
O  0.659661 -0.521346 -2.057288
O  -4.887142 -1.770953 -0.217068
C  2.787038 -1.376929 0.086716
C  3.107257 -0.0014 -0.411703
C  1.71138 -0.300359 0.082618
C  2.742276 -2.517091 -0.898556
C  3.293617 -1.786742 1.447321
C  3.95846 0.936716 0.362045
C  0.584428 -0.33767 -0.86642
C  5.256433 1.157034 0.137829
C  -1.79435 -0.144602 -0.971667
C  6.03255 2.132818 0.968713
C  6.044423 0.463659 -0.93056
C  -2.556422 -1.45572 -0.821682
C  -2.703112 0.903826 -0.389745
C  -3.912787 0.408005 -0.087903
C  -3.93204 -1.036217 -0.352446
C  -2.231279 2.299313 -0.229194
C  -5.085251 1.132486 0.476233
C  -5.048893 1.304871 1.968003
C  -4.06927 0.937499 2.784495
H  3.191389 0.070414 -1.492503
H  1.456274 0.089421 1.062451
H  3.722364 -2.996135 -0.945681
H  2.021921 -3.277804 -0.589875
H  2.48771 -2.203236 -1.908266
H  4.325202 -2.13944 1.378164
H  3.274954 -0.968985 2.167507
H  2.692016 -2.601664 1.854817
H  3.477897 1.477775 1.172383
H  -1.592277 0.087132 -2.020025
H  6.869617 1.641284 1.471827
H  6.466467 2.921399 0.347968
H  5.41471 2.607616 1.731092
H  6.471647 1.186292 -1.631059
H  6.889685 -0.0747 -0.493646
H  5.459775 -0.253386 -1.504918
H  -2.098693 -2.094971 -0.062594
H  -2.61489 -2.034656 -1.74388
H  -1.496303 2.365773 0.576288
H  -3.044213 2.983317 0.007985
H  -1.734879 2.650307 -1.136276
H  -5.180013 2.121228 0.016366
H  -6.006086 0.604667 0.210328
H  -5.927657 1.786986 2.385828
H  -4.139052 1.117166 3.849836
H  -3.163897 0.455604 2.434711
elementType: O C H
totalener: -965.42905526 hartree
nucrepener: 1780.17160484 hartree
electener: -2745.60066010 hartree
oneelecener: -4846.48023784 hartree
twoeener: 2100.87957773 hartree
cpcmener: -0.02925182 hartree
kineticenergy: 960.99600207 hartree
xcener: -95.138142627660 hartree
chargesum: 0.0000000
charge: -0.299775 -0.470467 -0.445697 0.141569 -0.016651 -0.128395 -0.296854 -0.267789 -0.252361 0.408671 -0.037497 0.256567 -0.228595 -0.249054 -0.137518 -0.046144 -0.089012 0.307798 -0.266377 -0.069630 -0.186956 -0.272518 0.099743 0.091446 0.095573 0.100454 0.094871 0.095555 0.091618 0.099597 0.119469 0.107010 0.093083 0.094600 0.088952 0.099248 0.095510 0.086844 0.099521 0.099968 0.110155 0.102814 0.119290 0.102796 0.090825 0.130063 0.130447 0.107237
qa: -0.2998 -0.4705 -0.4457 0.1416 -0.0167 -0.1284 -0.2969 -0.2678 -0.2524 0.4087 -0.0375 0.2566 -0.2286 -0.2491 -0.1375 -0.0461 -0.0890 0.3078 -0.2664 -0.0696 -0.1870 -0.2725 0.0997 0.0914 0.0956 0.1005 0.0949 0.0956 0.0916 0.0996 0.1195 0.1070 0.0931 0.0946 0.0890 0.0992 0.0955 0.0868 0.0995 0.1000 0.1102 0.1028 0.1193 0.1028 0.0908 0.1301 0.1304 0.1072
va: 2.1227 2.0411 2.0611 3.6703 3.7940 3.8973 3.9019 3.9055 3.8634 4.1710 3.7056 3.7256 3.9278 3.9406 3.9013 3.7144 3.4628 4.0586 3.9476 3.8278 3.8460 3.9002 1.0240 1.0363 1.0010 0.9993 1.0190 1.0024 1.0022 1.0029 1.0073 1.0290 0.9964 0.9955 1.0078 0.9984 0.9976 1.0086 1.0269 1.0256 0.9999 1.0027 0.9995 0.9996 1.0213 1.0027 1.0044 1.0204
dispcorr: -0.022632221 hartree
energy: -965.451687481674
dipole: 25.39639 -23.69070 1.70569 5.19047 -3.65541 1.53506 7.02958 -6.42662 0.60295
magnitude: 2.37262 au
magnitude: 6.03072 debye
