program: Orca
programVersion: 5.0.2
elementType: O O O C C C C C C C C C C C C C C C C C C C H H H H H H H H H H H H H H H H H H H H H H H H H H
charge: 0
multiplicity: 1
keywords: wb97x-d3
keywords: def2-TZVPP
keywords: def2/J RIJCOSX
keywords: DEFGRID2
keywords: scfconv7
keywords: smallprint printgap noloewdin
keywords: NOSOSCF
formula: C19H26O3
InChI: InChI=1/C19H26O3/c1-7-8-13-12(4)16(10-15(13)20)22-18(21)17-14(9-11(2)3)19(17,5)6/h7,9,14,16-17H,1,8,10H2,2-6H3
48 atoms
O  -0.003918 -0.172357 -0.610773
O  0.200858 0.517638 -2.729038
O  -3.637173 -1.998328 1.560861
C  2.564457 1.474054 -0.15937
C  2.853466 0.002108 -0.167783
C  2.094506 0.620057 -1.325543
C  1.591467 2.007246 0.864263
C  3.670478 2.452266 -0.474104
C  4.203924 -0.547915 -0.410838
C  0.681693 0.328248 -1.635653
C  4.857717 -1.400941 0.384051
C  -1.385881 -0.507047 -0.771646
C  6.217219 -1.912355 0.01397
C  4.320899 -1.933131 1.678651
C  -1.72587 -1.712166 0.092391
C  -2.276875 0.603383 -0.26683
C  -3.16209 0.152718 0.636504
C  -2.948853 -1.282035 0.866055
C  -2.161489 1.976613 -0.8145
C  -4.282376 0.884542 1.303853
C  -5.56538 0.671792 0.553749
C  -6.605367 -0.012301 1.012921
H  2.239103 -0.567111 0.520775
H  2.668142 0.767642 -2.234407
H  2.145022 2.356976 1.738345
H  1.031742 2.859983 0.473418
H  0.879513 1.263453 1.21403
H  4.283705 2.634384 0.411032
H  4.331245 2.108363 -1.269411
H  3.252611 3.410941 -0.788201
H  4.694972 -0.227966 -1.32557
H  -1.59844 -0.700378 -1.825509
H  6.230918 -3.005527 -0.013892
H  6.546031 -1.54867 -0.959563
H  6.964565 -1.615164 0.754746
H  4.05874 -2.990563 1.586186
H  5.080946 -1.873939 2.460935
H  3.441051 -1.404377 2.03938
H  -0.921256 -1.937525 0.796825
H  -1.917988 -2.617493 -0.483853
H  -2.893025 2.655792 -0.381321
H  -2.305391 1.968261 -1.897095
H  -1.169647 2.396172 -0.632256
H  -4.388559 0.534485 2.33292
H  -4.055996 1.952099 1.352872
H  -5.606006 1.104545 -0.442011
H  -7.501421 -0.141109 0.418922
H  -6.603673 -0.466513 1.997022
elementType: O C H
totalener: -965.42716198 hartree
nucrepener: 1802.72144468 hartree
electener: -2768.14860666 hartree
oneelecener: -4891.25816533 hartree
twoeener: 2123.10955867 hartree
cpcmener: -0.03123498 hartree
kineticenergy: 960.99492749 hartree
xcener: -95.138232425272 hartree
chargesum: 0.0000000
charge: -0.275963 -0.466308 -0.447429 0.132125 0.070779 -0.140069 -0.308338 -0.268213 -0.309987 0.402846 -0.024450 0.210706 -0.222879 -0.264627 -0.132016 -0.030559 -0.066224 0.280232 -0.253380 -0.111402 -0.177362 -0.275630 0.099863 0.088004 0.102226 0.101031 0.093352 0.095488 0.087866 0.097780 0.118400 0.109539 0.092964 0.087298 0.093774 0.101534 0.093405 0.091206 0.102386 0.098888 0.102985 0.117962 0.114375 0.097455 0.109845 0.140567 0.128149 0.111807
qa: -0.2760 -0.4663 -0.4474 0.1321 0.0708 -0.1401 -0.3083 -0.2682 -0.3100 0.4028 -0.0245 0.2107 -0.2229 -0.2646 -0.1320 -0.0306 -0.0662 0.2802 -0.2534 -0.1114 -0.1774 -0.2756 0.0999 0.0880 0.1022 0.1010 0.0934 0.0955 0.0879 0.0978 0.1184 0.1095 0.0930 0.0873 0.0938 0.1015 0.0934 0.0912 0.1024 0.0989 0.1030 0.1180 0.1144 0.0975 0.1098 0.1406 0.1281 0.1118
va: 2.1092 2.0339 2.0530 3.6477 3.7292 3.9021 3.9091 3.9101 3.8805 4.1797 3.7329 3.7787 3.9271 3.9467 3.9250 3.7306 3.4234 4.0828 3.9445 3.8708 3.7848 3.9566 1.0183 1.0359 1.0035 0.9961 1.0136 1.0026 1.0058 1.0017 1.0106 1.0303 0.9951 1.0092 0.9963 0.9953 0.9986 1.0072 1.0255 1.0251 1.0057 1.0030 0.9947 1.0200 1.0042 1.0004 1.0033 1.0136
dispcorr: -0.023297367 hartree
energy: -965.450459350507
dipole: 17.72253 -16.18287 1.53966 6.22817 -5.01689 1.21127 5.94100 -5.71929 0.22171
magnitude: 1.97152 au
magnitude: 5.01120 debye
