program: Orca
programVersion: 5.0.2
elementType: O O O C C C C C C C C C C C C C C C C C C C H H H H H H H H H H H H H H H H H H H H H H H H H H
charge: 0
multiplicity: 1
keywords: wb97x-d3
keywords: def2-TZVPP
keywords: def2/J RIJCOSX
keywords: DEFGRID2
keywords: scfconv7
keywords: smallprint printgap noloewdin
keywords: NOSOSCF
formula: C19H26O3
InChI: InChI=1/C19H26O3/c1-7-8-13-12(4)16(10-15(13)20)22-18(21)17-14(9-11(2)3)19(17,5)6/h7,9,14,16-17H,1,8,10H2,2-6H3
48 atoms
O  -0.522523 -0.095704 -1.040601
O  0.496242 1.896561 -0.930016
O  -5.048264 -1.025566 -1.219509
C  2.982288 0.249503 -1.894782
C  3.05926 0.461069 -0.416049
C  1.788566 -0.114734 -1.028708
C  2.948112 1.462968 -2.79168
C  3.698603 -0.919595 -2.529025
C  3.89299 -0.365963 0.474828
C  0.555981 0.691494 -0.995703
C  4.438588 0.023197 1.632533
C  -1.826208 0.489416 -0.977123
C  5.312279 -0.907853 2.417972
C  4.272097 1.382632 2.244186
C  -2.805587 -0.316097 -1.817869
C  -2.373927 0.422634 0.42786
C  -3.60018 -0.123279 0.45482
C  -3.978355 -0.554336 -0.896577
C  -1.599518 0.95887 1.57268
C  -4.487218 -0.334241 1.641206
C  -4.124935 -1.5956 2.367817
C  -3.737254 -1.648692 3.635955
H  2.95668 1.5002 -0.123173
H  1.632269 -1.179673 -0.897926
H  3.962974 1.697998 -3.119397
H  2.352067 1.275239 -3.687251
H  2.553279 2.3505 -2.302833
H  4.757201 -0.692771 -2.670927
H  3.62973 -1.835435 -1.943237
H  3.272776 -1.133002 -3.511424
H  4.086787 -1.382965 0.147484
H  -1.782676 1.529528 -1.308227
H  4.888535 -1.106109 3.406288
H  5.457185 -1.864345 1.91534
H  6.298319 -0.46716 2.590084
H  5.184257 1.975486 2.129939
H  3.450541 1.958566 1.821573
H  4.092957 1.298329 3.318602
H  -2.380175 -1.281718 -2.103266
H  -3.113391 0.189625 -2.733343
H  -0.68012 0.386783 1.721379
H  -2.162202 0.923723 2.503341
H  -1.301042 1.992919 1.38919
H  -4.429798 0.518044 2.321138
H  -5.524434 -0.395552 1.298506
H  -4.183922 -2.512847 1.78848
H  -3.4851 -2.588981 4.109987
H  -3.667415 -0.758711 4.251476
elementType: O C H
totalener: -965.42938364 hartree
nucrepener: 1783.88993551 hartree
electener: -2749.31931915 hartree
oneelecener: -4853.87166933 hartree
twoeener: 2104.55235018 hartree
cpcmener: -0.02782216 hartree
kineticenergy: 960.98591962 hartree
xcener: -95.136441250879 hartree
chargesum: 0.0000000
charge: -0.292377 -0.471922 -0.450501 0.104712 0.017495 -0.080398 -0.275718 -0.284953 -0.272792 0.383593 -0.029757 0.258480 -0.220916 -0.264629 -0.136202 -0.057154 -0.062124 0.289800 -0.243579 -0.097736 -0.181378 -0.281981 0.097613 0.088482 0.095624 0.096996 0.092572 0.100330 0.090166 0.097365 0.113975 0.102722 0.093738 0.087247 0.093117 0.102222 0.092646 0.092902 0.100186 0.098148 0.113791 0.097503 0.118118 0.103257 0.096461 0.143088 0.129639 0.112129
qa: -0.2924 -0.4719 -0.4505 0.1047 0.0175 -0.0804 -0.2757 -0.2850 -0.2728 0.3836 -0.0298 0.2585 -0.2209 -0.2646 -0.1362 -0.0572 -0.0621 0.2898 -0.2436 -0.0977 -0.1814 -0.2820 0.0976 0.0885 0.0956 0.0970 0.0926 0.1003 0.0902 0.0974 0.1140 0.1027 0.0937 0.0872 0.0931 0.1022 0.0926 0.0929 0.1002 0.0981 0.1138 0.0975 0.1181 0.1033 0.0965 0.1431 0.1296 0.1121
va: 2.1263 2.0324 2.0517 3.7117 3.8011 3.8165 3.9033 3.9163 3.9044 4.1929 3.7436 3.7378 3.9247 3.9398 3.9062 3.7865 3.4229 4.0699 3.9329 3.8574 3.7995 3.9414 1.0243 1.0355 0.9999 0.9996 1.0194 1.0002 1.0066 1.0014 1.0125 1.0310 0.9965 1.0090 0.9947 0.9949 1.0092 0.9979 1.0289 1.0247 0.9991 1.0073 1.0072 1.0043 1.0246 1.0030 1.0038 1.0096
dispcorr: -0.021935611 hartree
energy: -965.451319253865
dipole: 24.35922 -22.37935 1.97987 0.06672 0.02139 0.08810 9.49279 -8.79543 0.69736
magnitude: 2.10095 au
magnitude: 5.34018 debye
