program: Orca
programVersion: 5.0.2
elementType: O O O C C C C C C C C C C C C C C C C C C C H H H H H H H H H H H H H H H H H H H H H H H H H H
charge: 0
multiplicity: 1
keywords: wb97x-d3
keywords: def2-TZVPP
keywords: def2/J RIJCOSX
keywords: DEFGRID2
keywords: scfconv7
keywords: smallprint printgap noloewdin
keywords: NOSOSCF
formula: C19H26O3
InChI: InChI=1/C19H26O3/c1-7-8-13-12(4)16(10-15(13)20)22-18(21)17-14(9-11(2)3)19(17,5)6/h7,9,14,16-17H,1,8,10H2,2-6H3
48 atoms
O  -0.163679 -0.386232 -1.511317
O  -0.095678 0.025157 0.688656
O  -3.627606 -2.564502 0.844171
C  2.382338 1.77263 -0.227338
C  2.823515 0.535764 0.473237
C  1.835105 0.420263 -0.670404
C  1.494259 2.754201 0.496457
C  3.321294 2.431206 -1.208898
C  4.194053 -0.019217 0.323229
C  0.449198 0.013959 -0.392148
C  4.492995 -1.320387 0.349369
C  -1.525368 -0.816717 -1.458209
C  5.903312 -1.802292 0.201434
C  3.464356 -2.396368 0.513945
C  -1.79521 -2.100003 -0.678741
C  -2.468008 0.203608 -0.876513
C  -3.345027 -0.358443 -0.029124
C  -3.017399 -1.773771 0.148868
C  -2.398225 1.627266 -1.282815
C  -4.448749 0.326275 0.713639
C  -3.902795 1.074639 1.894051
C  -3.966452 2.392172 2.042552
H  2.369747 0.388016 1.450613
H  2.226807 0.060183 -1.614787
H  2.11017 3.512862 0.98299
H  0.830132 3.269629 -0.200455
H  0.882201 2.291479 1.267676
H  2.762112 3.023925 -1.934679
H  4.004894 3.106262 -0.690106
H  3.922001 1.710834 -1.76388
H  5.002497 0.696906 0.204135
H  -1.77624 -0.953174 -2.512197
H  5.997101 -2.47525 -0.654687
H  6.606163 -0.980956 0.063864
H  6.216623 -2.374099 1.078463
H  3.733049 -3.061297 1.338242
H  2.46437 -2.012108 0.707892
H  3.415236 -3.022217 -0.381195
H  -0.970847 -2.385982 -0.023614
H  -1.993201 -2.950881 -1.331267
H  -1.676193 2.165047 -0.661483
H  -3.357918 2.128779 -1.165971
H  -2.073639 1.732511 -2.318016
H  -4.982388 1.012986 0.053111
H  -5.173077 -0.41976 1.051262
H  -3.410828 0.472636 2.652488
H  -3.542668 2.883312 2.909149
H  -4.444153 3.028084 1.305991
elementType: O C H
totalener: -965.41462041 hartree
nucrepener: 1847.96937233 hartree
electener: -2813.38399274 hartree
oneelecener: -4982.73275838 hartree
twoeener: 2169.34876564 hartree
cpcmener: -0.03710632 hartree
kineticenergy: 961.00053463 hartree
xcener: -95.142873205824 hartree
chargesum: -0.0000000
charge: -0.300655 -0.496963 -0.492948 0.163604 -0.021272 -0.117674 -0.290997 -0.290453 -0.304874 0.408507 -0.011839 0.290032 -0.228891 -0.240672 -0.155875 0.002253 -0.125597 0.308924 -0.283965 -0.099017 -0.181403 -0.291241 0.104085 0.091958 0.102024 0.098478 0.093569 0.098055 0.100362 0.093409 0.125705 0.120852 0.094716 0.090186 0.096540 0.101382 0.078320 0.100509 0.114526 0.110853 0.118882 0.112507 0.121660 0.106719 0.092512 0.145062 0.132218 0.115929
qa: -0.3007 -0.4970 -0.4929 0.1636 -0.0213 -0.1177 -0.2910 -0.2905 -0.3049 0.4085 -0.0118 0.2900 -0.2289 -0.2407 -0.1559 0.0023 -0.1256 0.3089 -0.2840 -0.0990 -0.1814 -0.2912 0.1041 0.0920 0.1020 0.0985 0.0936 0.0981 0.1004 0.0934 0.1257 0.1209 0.0947 0.0902 0.0965 0.1014 0.0783 0.1005 0.1145 0.1109 0.1189 0.1125 0.1217 0.1067 0.0925 0.1451 0.1322 0.1159
va: 2.1277 2.0018 2.0015 3.6809 3.8196 3.8275 3.8906 3.9080 3.8887 4.1283 3.7023 3.7660 3.9299 3.9373 3.8739 3.6546 3.4795 4.0395 3.9396 3.8636 3.7838 3.9379 1.0261 1.0332 1.0029 0.9992 1.0166 1.0027 0.9994 1.0017 1.0026 0.9915 0.9962 1.0059 0.9964 1.0000 1.0160 0.9978 1.0239 1.0220 0.9921 0.9993 1.0054 1.0074 1.0256 1.0015 1.0032 1.0091
dispcorr: -0.024625360 hartree
energy: -965.439245771486
dipole: 17.97665 -16.42524 1.55141 10.15496 -8.70279 1.45218 -0.51004 -1.73031 -2.24035
magnitude: 3.08786 au
magnitude: 7.84872 debye
