program: Orca
programVersion: 5.0.2
elementType: O O O C C C C C C C C C C C C C C C C C C C H H H H H H H H H H H H H H H H H H H H H H H H H H
charge: 0
multiplicity: 1
keywords: wb97x-d3
keywords: def2-TZVPP
keywords: def2/J RIJCOSX
keywords: DEFGRID2
keywords: scfconv7
keywords: smallprint printgap noloewdin
keywords: NOSOSCF
formula: C19H26O3
InChI: InChI=1/C19H26O3/c1-7-8-13-12(4)16(10-15(13)20)22-18(21)17-14(9-11(2)3)19(17,5)6/h7,9,14,16-17H,1,8,10H2,2-6H3
48 atoms
O  -0.424322 -0.039427 -0.933904
O  0.57418 1.964237 -1.076193
O  -4.981579 -0.914411 -1.004986
C  2.998257 0.161571 -2.03228
C  3.195913 0.630899 -0.63441
C  1.884478 -0.037163 -1.01239
C  2.859967 1.186641 -3.12982
C  3.669556 -1.111496 -2.487434
C  4.123654 -0.023092 0.321986
C  0.647292 0.757316 -1.017747
C  4.025095 0.069145 1.650896
C  -1.728898 0.53648 -0.83666
C  5.035087 -0.567468 2.555276
C  2.922041 0.808145 2.344458
C  -2.735864 -0.259726 -1.65229
C  -2.231471 0.457388 0.581812
C  -3.470112 -0.058186 0.640134
C  -3.890432 -0.470784 -0.702301
C  -1.399563 0.937359 1.710453
C  -4.331235 -0.238545 1.842702
C  -4.045959 -1.477434 2.641199
C  -3.072544 -2.353499 2.424494
H  3.102588 1.707257 -0.51375
H  1.754828 -1.061435 -0.682657
H  2.46449 2.137219 -2.77953
H  3.840859 1.385148 -3.565486
H  2.21364 0.822709 -3.93036
H  3.706705 -1.868698 -1.704529
H  3.133047 -1.54103 -3.335164
H  4.69328 -0.91428 -2.810899
H  4.954041 -0.583446 -0.09811
H  -1.700782 1.579773 -1.157266
H  4.561635 -1.285057 3.229885
H  5.813689 -1.088334 1.998457
H  5.516813 0.180419 3.19039
H  2.413836 0.155656 3.058883
H  3.323397 1.643244 2.92486
H  2.171426 1.206637 1.663176
H  -2.330599 -1.235329 -1.932302
H  -3.053396 0.241042 -2.566527
H  -1.952075 0.954441 2.64791
H  -1.01278 1.938989 1.514516
H  -0.532335 0.28611 1.848249
H  -4.239739 0.626846 2.505775
H  -5.382228 -0.25514 1.540159
H  -4.718282 -1.636091 3.478696
H  -2.948469 -3.212341 3.071426
H  -2.364827 -2.254251 1.610134
elementType: O C H
totalener: -965.41736394 hartree
nucrepener: 1816.88740004 hartree
electener: -2782.30476397 hartree
oneelecener: -4919.74936664 hartree
twoeener: 2137.44460267 hartree
cpcmener: -0.03498880 hartree
kineticenergy: 960.99574608 hartree
xcener: -95.142073368305 hartree
chargesum: -0.0000000
charge: -0.297945 -0.499872 -0.485288 0.157721 -0.030031 -0.096379 -0.274901 -0.293100 -0.292850 0.397147 -0.007623 0.271113 -0.230711 -0.246513 -0.144457 -0.035751 -0.100842 0.328397 -0.255919 -0.074496 -0.189662 -0.282413 0.100992 0.092863 0.090182 0.097262 0.100551 0.092940 0.098675 0.100953 0.125321 0.105914 0.096116 0.089983 0.095515 0.098339 0.104064 0.071789 0.103144 0.100169 0.108571 0.121476 0.115518 0.105714 0.088800 0.134305 0.133166 0.112050
qa: -0.2979 -0.4999 -0.4853 0.1577 -0.0300 -0.0964 -0.2749 -0.2931 -0.2929 0.3971 -0.0076 0.2711 -0.2307 -0.2465 -0.1445 -0.0358 -0.1008 0.3284 -0.2559 -0.0745 -0.1897 -0.2824 0.1010 0.0929 0.0902 0.0973 0.1006 0.0929 0.0987 0.1010 0.1253 0.1059 0.0961 0.0900 0.0955 0.0983 0.1041 0.0718 0.1031 0.1002 0.1086 0.1215 0.1155 0.1057 0.0888 0.1343 0.1332 0.1121
va: 2.1246 1.9963 2.0119 3.7057 3.8172 3.8052 3.8890 3.9132 3.8886 4.1522 3.6951 3.7289 3.9282 3.9450 3.9148 3.7133 3.4572 4.0117 3.9246 3.8331 3.8345 3.8986 1.0271 1.0337 1.0174 1.0007 0.9996 1.0009 1.0026 0.9988 1.0033 1.0331 0.9965 1.0062 0.9956 0.9979 0.9997 1.0143 1.0270 1.0250 1.0043 1.0062 0.9955 0.9991 1.0220 1.0019 1.0040 1.0176
dispcorr: -0.023718872 hartree
energy: -965.441082807165
dipole: 21.92294 -19.92901 1.99393 -2.04322 2.07686 0.03364 8.62666 -7.55935 1.06731
magnitude: 2.26187 au
magnitude: 5.74922 debye
