program: Orca
programVersion: 5.0.2
elementType: O O O C C C C C C C C C C C C C C C C C C C H H H H H H H H H H H H H H H H H H H H H H H H H H
charge: 0
multiplicity: 1
keywords: wb97x-d3
keywords: def2-TZVPP
keywords: def2/J RIJCOSX
keywords: DEFGRID2
keywords: scfconv7
keywords: smallprint printgap noloewdin
keywords: NOSOSCF
formula: C19H26O3
InChI: InChI=1/C19H26O3/c1-7-8-13-12(4)16(10-15(13)20)22-18(21)17-14(9-11(2)3)19(17,5)6/h7,9,14,16-17H,1,8,10H2,2-6H3
48 atoms
O  -0.466254 -0.069549 -1.00238
O  0.556815 1.924157 -1.049294
O  -4.901228 -1.199658 -0.820325
C  3.027932 0.243769 -1.985079
C  3.124815 0.481071 -0.513593
C  1.840006 -0.09664 -1.102072
C  2.993731 1.439103 -2.906167
C  3.721998 -0.945458 -2.606463
C  3.952461 -0.339278 0.389968
C  0.614297 0.714736 -1.054095
C  4.37652 0.012694 1.608836
C  -1.768339 0.51929 -0.911904
C  5.245569 -0.907464 2.412055
C  4.049294 1.305128 2.292718
C  -2.779552 -0.354622 -1.638845
C  -2.236307 0.551552 0.523135
C  -3.429338 -0.047709 0.667795
C  -3.854939 -0.615766 -0.614618
C  -1.424935 1.214915 1.570983
C  -4.249142 -0.216611 1.905613
C  -3.980298 -1.550579 2.537295
C  -4.870041 -2.529563 2.642396
H  3.03013 1.525215 -0.235961
H  1.681513 -1.157697 -0.947657
H  4.004603 1.646614 -3.262354
H  2.373203 1.242466 -3.782445
H  2.627789 2.343788 -2.426704
H  4.780713 -0.732933 -2.765722
H  3.648157 -1.848648 -2.002361
H  3.280151 -1.169457 -3.578927
H  4.244543 -1.318172 0.022449
H  -1.74861 1.531713 -1.320077
H  5.47674 -1.828778 1.877777
H  6.189885 -0.423025 2.67368
H  4.76535 -1.174654 3.357012
H  4.956903 1.884866 2.477221
H  3.356601 1.936684 1.74066
H  3.606682 1.110839 3.272481
H  -2.340169 -1.304306 -1.951702
H  -3.194523 0.12039 -2.528117
H  -0.47022 0.700575 1.705903
H  -1.930106 1.229015 2.53457
H  -1.192361 2.243157 1.287899
H  -4.016486 0.579493 2.61607
H  -5.309652 -0.126492 1.660601
H  -2.971309 -1.699653 2.91108
H  -4.615548 -3.47575 3.102629
H  -5.883763 -2.422191 2.274062
elementType: O C H
totalener: -965.41843472 hartree
nucrepener: 1785.94970821 hartree
electener: -2751.36814293 hartree
oneelecener: -4858.10703214 hartree
twoeener: 2106.73888921 hartree
cpcmener: -0.03633011 hartree
kineticenergy: 961.00346122 hartree
xcener: -95.142224012974 hartree
chargesum: -0.0000000
charge: -0.297457 -0.501325 -0.485059 0.118899 -0.007016 -0.074317 -0.277553 -0.291439 -0.268725 0.404810 -0.033531 0.267669 -0.224099 -0.258179 -0.140643 -0.038987 -0.073985 0.304338 -0.250886 -0.103589 -0.179522 -0.285464 0.101905 0.091350 0.096732 0.099109 0.090937 0.102070 0.091910 0.098449 0.119147 0.105509 0.088978 0.093926 0.094423 0.098896 0.089242 0.095523 0.103211 0.103120 0.113596 0.104720 0.116544 0.111336 0.094391 0.144764 0.131979 0.114294
qa: -0.2975 -0.5013 -0.4851 0.1189 -0.0070 -0.0743 -0.2776 -0.2914 -0.2687 0.4048 -0.0335 0.2677 -0.2241 -0.2582 -0.1406 -0.0390 -0.0740 0.3043 -0.2509 -0.1036 -0.1795 -0.2855 0.1019 0.0913 0.0967 0.0991 0.0909 0.1021 0.0919 0.0984 0.1191 0.1055 0.0890 0.0939 0.0944 0.0989 0.0892 0.0955 0.1032 0.1031 0.1136 0.1047 0.1165 0.1113 0.0944 0.1448 0.1320 0.1143
va: 2.1254 1.9977 2.0072 3.7110 3.8178 3.8159 3.8983 3.9180 3.8973 4.1540 3.7457 3.7301 3.9228 3.9405 3.9232 3.7789 3.4452 4.0471 3.9367 3.8617 3.7854 3.9490 1.0207 1.0350 1.0000 0.9992 1.0193 0.9996 1.0054 1.0010 1.0105 1.0296 1.0082 0.9952 0.9964 0.9969 1.0117 0.9971 1.0295 1.0226 0.9979 1.0060 1.0049 1.0052 1.0208 1.0000 1.0025 1.0123
dispcorr: -0.021953522 hartree
energy: -965.440388242326
dipole: 22.78401 -20.65164 2.13237 -0.25147 0.57562 0.32415 8.01110 -7.28577 0.72533
magnitude: 2.27556 au
magnitude: 5.78401 debye
