program: Orca
programVersion: 5.0.2
elementType: O O O C C C C C C C C C C C C C C C C C C C H H H H H H H H H H H H H H H H H H H H H H H H H H
charge: 0
multiplicity: 1
keywords: wb97x-d3
keywords: def2-TZVPP
keywords: def2/J RIJCOSX
keywords: DEFGRID2
keywords: scfconv7
keywords: smallprint printgap noloewdin
keywords: NOSOSCF
formula: C19H26O3
InChI: InChI=1/C19H26O3/c1-7-8-13-12(4)16(10-15(13)20)22-18(21)17-14(9-11(2)3)19(17,5)6/h7,9,14,16-17H,1,8,10H2,2-6H3
48 atoms
O  -0.203918 -0.350177 -1.574359
O  -0.084163 0.045973 0.626173
O  -3.607223 -2.565804 0.829693
C  2.39209 1.771741 -0.367496
C  2.824288 0.548477 0.362527
C  1.823549 0.415796 -0.769361
C  1.526579 2.781504 0.345064
C  3.318476 2.395708 -1.382389
C  4.180543 -0.041712 0.232846
C  0.437755 0.031216 -0.466131
C  4.475526 -1.316642 0.501676
C  -1.565584 -0.774396 -1.492644
C  5.876137 -1.835699 0.392953
C  3.453966 -2.326224 0.926307
C  -1.815547 -2.072464 -0.731629
C  -2.489686 0.236062 -0.864166
C  -3.346246 -0.343871 -0.007957
C  -3.015358 -1.762615 0.13271
C  -2.424255 1.667361 -1.242538
C  -4.426029 0.31985 0.786498
C  -3.847558 0.958353 2.015136
C  -3.859895 2.262616 2.261037
H  2.370278 0.436163 1.343781
H  2.201315 0.0310 -1.709669
H  2.159874 3.538587 0.811634
H  0.864908 3.295355 -0.35541
H  0.914003 2.344308 1.131092
H  4.023569 3.071961 -0.895294
H  3.894253 1.656195 -1.938504
H  2.748541 2.980916 -2.105929
H  4.983348 0.622102 -0.074828
H  -1.846451 -0.889154 -2.541545
H  6.578622 -1.061796 0.084609
H  6.217654 -2.242527 1.348067
H  5.934866 -2.654262 -0.328809
H  3.693214 -2.726032 1.915034
H  2.440957 -1.928738 0.963809
H  3.453014 -3.179686 0.243694
H  -0.974079 -2.371151 -0.104136
H  -2.030541 -2.910313 -1.395433
H  -1.652021 2.180595 -0.66372
H  -3.363553 2.182478 -1.050677
H  -2.169401 1.789673 -2.294771
H  -4.938856 1.070987 0.182667
H  -5.172784 -0.425674 1.072794
H  -3.374791 0.283785 2.723274
H  -3.414794 2.671506 3.159086
H  -4.319932 2.968507 1.579085
elementType: O C H
totalener: -965.41475746 hartree
nucrepener: 1845.94512421 hartree
electener: -2811.35988167 hartree
oneelecener: -4978.72510280 hartree
twoeener: 2167.36522113 hartree
cpcmener: -0.03738223 hartree
kineticenergy: 961.00870069 hartree
xcener: -95.144404265637 hartree
chargesum: -0.0000000
charge: -0.299320 -0.497811 -0.493482 0.170516 -0.043073 -0.104102 -0.287808 -0.294953 -0.292049 0.407188 -0.013773 0.291238 -0.229752 -0.242611 -0.156306 -0.001125 -0.124235 0.310246 -0.279187 -0.102357 -0.180723 -0.291491 0.102765 0.091367 0.102815 0.098471 0.093177 0.101608 0.092109 0.098648 0.126975 0.120604 0.089660 0.095626 0.095217 0.101545 0.076883 0.097252 0.114331 0.110798 0.118295 0.111194 0.122092 0.105670 0.094390 0.145261 0.132343 0.115878
qa: -0.2993 -0.4978 -0.4935 0.1705 -0.0431 -0.1041 -0.2878 -0.2950 -0.2920 0.4072 -0.0138 0.2912 -0.2298 -0.2426 -0.1563 -0.0011 -0.1242 0.3102 -0.2792 -0.1024 -0.1807 -0.2915 0.1028 0.0914 0.1028 0.0985 0.0932 0.1016 0.0921 0.0986 0.1270 0.1206 0.0897 0.0956 0.0952 0.1015 0.0769 0.0973 0.1143 0.1108 0.1183 0.1112 0.1221 0.1057 0.0944 0.1453 0.1323 0.1159
va: 2.1319 1.9985 2.0000 3.6872 3.8323 3.8214 3.8870 3.9102 3.8796 4.1352 3.7063 3.7668 3.9287 3.9408 3.8781 3.6632 3.4761 4.0414 3.9391 3.8668 3.7822 3.9403 1.0261 1.0344 1.0027 0.9995 1.0158 0.9988 1.0014 1.0023 1.0027 0.9913 1.0064 0.9955 0.9964 0.9989 1.0178 0.9984 1.0233 1.0219 0.9930 1.0007 1.0042 1.0080 1.0243 1.0019 1.0031 1.0092
dispcorr: -0.024423944 hartree
energy: -965.439181402605
dipole: 18.03041 -16.54039 1.49002 10.03545 -8.54721 1.48824 0.47992 -2.67484 -2.19492
magnitude: 3.04182 au
magnitude: 7.73169 debye
