program: Orca
programVersion: 5.0.2
elementType: O O O C C C C C C C C C C C C C C C C C C C H H H H H H H H H H H H H H H H H H H H H H H H H H
charge: 0
multiplicity: 1
keywords: wb97x-d3
keywords: def2-TZVPP
keywords: def2/J RIJCOSX
keywords: DEFGRID2
keywords: scfconv7
keywords: smallprint printgap noloewdin
keywords: NOSOSCF
formula: C19H26O3
InChI: InChI=1/C19H26O3/c1-7-8-13-12(4)16(10-15(13)20)22-18(21)17-14(9-11(2)3)19(17,5)6/h7,9,14,16-17H,1,8,10H2,2-6H3
48 atoms
O  -0.321726 -0.081012 -1.536688
O  0.128895 -0.130009 0.655281
O  -3.920376 -2.132757 0.765822
C  2.674866 1.421326 -0.499715
C  3.041031 0.072775 0.046131
C  1.894093 0.190267 -0.933816
C  2.056633 2.425527 0.440843
C  3.531951 2.061397 -1.564237
C  4.2671 -0.642052 -0.360268
C  0.506006 -0.027743 -0.48939
C  5.131973 -1.264474 0.447839
C  -1.723464 -0.263819 -1.331356
C  6.341765 -1.951444 -0.111756
C  5.009129 -1.34702 1.938822
C  -2.146619 -1.633738 -0.813716
C  -2.360421 0.730239 -0.391839
C  -3.229335 0.130193 0.438416
C  -3.20425 -1.317077 0.215211
C  -2.078892 2.178525 -0.530176
C  -4.165047 0.749964 1.426023
C  -5.53725 0.893418 0.836079
C  -6.607289 0.218098 1.236966
H  2.728499 -0.079234 1.073657
H  2.092549 -0.127507 -1.951697
H  2.84078 3.051084 0.871356
H  1.365084 3.085399 -0.087459
H  1.520418 1.965855 1.268636
H  4.389094 2.565855 -1.113898
H  3.911071 1.345221 -2.291572
H  2.958126 2.811699 -2.111022
H  4.477356 -0.658067 -1.425831
H  -2.136087 -0.095362 -2.328443
H  6.354252 -3.009352 0.163213
H  6.388562 -1.88522 -1.198532
H  7.260229 -1.518314 0.292808
H  4.950431 -2.388917 2.259831
H  5.897501 -0.9288 2.416232
H  4.143812 -0.826136 2.340633
H  -1.329363 -2.181962 -0.340844
H  -2.54846 -2.274619 -1.598796
H  -2.240264 2.496857 -1.562062
H  -1.037489 2.40791 -0.293221
H  -2.707977 2.785144 0.11723
H  -4.208443 0.135232 2.327813
H  -3.79061 1.730441 1.727571
H  -5.623451 1.593413 0.009991
H  -7.570042 0.352678 0.760747
H  -6.559695 -0.499639 2.047678
elementType: O C H
totalener: -965.41644574 hartree
nucrepener: 1801.63648563 hartree
electener: -2767.05293138 hartree
oneelecener: -4889.97132205 hartree
twoeener: 2122.91839068 hartree
cpcmener: -0.04077226 hartree
kineticenergy: 961.00091145 hartree
xcener: -95.144359423959 hartree
chargesum: -0.0000000
charge: -0.297000 -0.489155 -0.492398 0.122433 0.035126 -0.108425 -0.294753 -0.274667 -0.288739 0.401239 -0.050162 0.274284 -0.218334 -0.251265 -0.148781 0.012461 -0.124843 0.304406 -0.255269 -0.116178 -0.176039 -0.290158 0.092541 0.090985 0.106180 0.098218 0.095653 0.097485 0.090127 0.097931 0.122192 0.122027 0.092986 0.088695 0.093646 0.096695 0.095709 0.089894 0.113734 0.108316 0.116124 0.116134 0.103293 0.098735 0.108887 0.144149 0.131715 0.114168
qa: -0.2970 -0.4892 -0.4924 0.1224 0.0351 -0.1084 -0.2948 -0.2747 -0.2887 0.4012 -0.0502 0.2743 -0.2183 -0.2513 -0.1488 0.0125 -0.1248 0.3044 -0.2553 -0.1162 -0.1760 -0.2902 0.0925 0.0910 0.1062 0.0982 0.0957 0.0975 0.0901 0.0979 0.1222 0.1220 0.0930 0.0887 0.0936 0.0967 0.0957 0.0899 0.1137 0.1083 0.1161 0.1161 0.1033 0.0987 0.1089 0.1441 0.1317 0.1142
va: 2.1320 2.0185 1.9997 3.6652 3.7876 3.8260 3.9041 3.9078 3.8716 4.1813 3.7585 3.7859 3.9202 3.9410 3.8990 3.6409 3.4794 4.0528 3.9528 3.8748 3.7808 3.9506 1.0319 1.0371 1.0019 0.9993 1.0151 1.0020 1.0059 1.0018 1.0099 0.9921 0.9963 1.0086 0.9961 0.9967 0.9973 1.0104 1.0241 1.0240 0.9977 0.9947 1.0042 1.0184 1.0064 0.9999 1.0027 1.0129
dispcorr: -0.023047641 hartree
energy: -965.439493384686
dipole: 20.39669 -18.57513 1.82157 8.89017 -6.86860 2.02158 1.32481 -3.13254 -1.80773
magnitude: 3.26692 au
magnitude: 8.30385 debye
