program: Orca
programVersion: 5.0.2
elementType: O O O C C C C C C C C C C C C C C C C C C C H H H H H H H H H H H H H H H H H H H H H H H H H H
charge: 0
multiplicity: 1
keywords: wb97x-d3
keywords: def2-TZVPP
keywords: def2/J RIJCOSX
keywords: DEFGRID2
keywords: scfconv7
keywords: smallprint printgap noloewdin
keywords: NOSOSCF
formula: C19H26O3
InChI: InChI=1/C19H26O3/c1-7-8-13-12(4)16(10-15(13)20)22-18(21)17-14(9-11(2)3)19(17,5)6/h7,9,14,16-17H,1,8,10H2,2-6H3
48 atoms
O  -0.114093 -0.423718 -1.51538
O  -0.068959 0.289528 0.604733
O  -3.676637 -2.20275 1.024974
C  2.496243 1.799811 -0.461896
C  2.885328 0.633482 0.377513
C  1.896557 0.427578 -0.753453
C  1.651212 2.891919 0.144367
C  3.457438 2.304725 -1.510295
C  4.234521 0.014771 0.303403
C  0.494059 0.109237 -0.451307
C  4.485643 -1.290642 0.43352
C  -1.488222 -0.804485 -1.426739
C  5.882161 -1.827911 0.361661
C  3.419263 -2.319701 0.65081
C  -1.796823 -1.970739 -0.493558
C  -2.415055 0.304845 -0.996845
C  -3.317036 -0.129081 -0.101845
C  -3.026408 -1.518683 0.25707
C  -2.30933 1.651207 -1.606997
C  -4.430441 0.627135 0.548323
C  -3.992987 1.138774 1.8912
C  -4.472953 0.714212 3.054314
H  2.423558 0.619782 1.362337
H  2.283772 -0.049993 -1.646158
H  2.300496 3.676145 0.538289
H  1.002863 3.35081 -0.604799
H  1.02878 2.54597 0.966194
H  4.167872 3.0095 -1.074073
H  4.027317 1.501211 -1.976591
H  2.916873 2.828459 -2.30058
H  5.073033 0.68983 0.154775
H  -1.731181 -1.070763 -2.457517
H  5.974487 -2.566582 -0.438875
H  6.616003 -1.042329 0.183224
H  6.153148 -2.341806 1.287476
H  2.423541 -1.89446 0.766641
H  3.389958 -3.025604 -0.184239
H  3.635754 -2.911777 1.544307
H  -0.991101 -2.182226 0.2116
H  -1.996658 -2.896749 -1.033888
H  -3.173088 2.2731 -1.378776
H  -2.209141 1.577626 -2.691658
H  -1.421751 2.176832 -1.243545
H  -4.731943 1.465475 -0.085555
H  -5.304068 -0.02007 0.661413
H  -3.208235 1.890835 1.876353
H  -4.108476 1.109015 3.994913
H  -5.248965 -0.041326 3.108036
elementType: O C H
totalener: -965.41509009 hartree
nucrepener: 1841.92830982 hartree
electener: -2807.34339991 hartree
oneelecener: -4970.75506778 hartree
twoeener: 2163.41166787 hartree
cpcmener: -0.03945788 hartree
kineticenergy: 960.99163517 hartree
xcener: -95.141147410410 hartree
chargesum: -0.0000000
charge: -0.301552 -0.497776 -0.490297 0.156805 -0.018237 -0.119946 -0.292585 -0.288816 -0.302202 0.405605 -0.014960 0.294907 -0.228743 -0.239153 -0.155469 -0.006075 -0.123789 0.300585 -0.259604 -0.107468 -0.179129 -0.286695 0.105510 0.093367 0.102463 0.097559 0.095879 0.099598 0.094317 0.098304 0.125010 0.120622 0.094640 0.090125 0.096608 0.079468 0.100235 0.101634 0.115321 0.110948 0.106387 0.116876 0.115124 0.111149 0.094442 0.143424 0.131564 0.114020
qa: -0.3016 -0.4978 -0.4903 0.1568 -0.0182 -0.1199 -0.2926 -0.2888 -0.3022 0.4056 -0.0150 0.2949 -0.2287 -0.2392 -0.1555 -0.0061 -0.1238 0.3006 -0.2596 -0.1075 -0.1791 -0.2867 0.1055 0.0934 0.1025 0.0976 0.0959 0.0996 0.0943 0.0983 0.1250 0.1206 0.0946 0.0901 0.0966 0.0795 0.1002 0.1016 0.1153 0.1109 0.1064 0.1169 0.1151 0.1111 0.0944 0.1434 0.1316 0.1140
va: 2.1265 2.0024 2.0022 3.6804 3.8152 3.8271 3.8930 3.9072 3.8898 4.1345 3.7060 3.7607 3.9297 3.9358 3.8842 3.6798 3.4669 4.0567 3.9484 3.8686 3.7769 3.9468 1.0250 1.0328 1.0023 0.9999 1.0163 0.9998 1.0018 1.0025 1.0029 0.9914 0.9964 1.0059 0.9963 1.0146 0.9982 0.9998 1.0240 1.0225 1.0040 0.9993 0.9954 1.0075 1.0199 1.0012 1.0029 1.0128
dispcorr: -0.024268746 hartree
energy: -965.439358839625
dipole: 17.91580 -16.24389 1.67191 7.73994 -6.50619 1.23375 -0.75360 -1.71623 -2.46982
magnitude: 3.22761 au
magnitude: 8.20393 debye
