program: Orca
programVersion: 5.0.2
elementType: O O O C C C C C C C C C C C C C C C C C C C H H H H H H H H H H H H H H H H H H H H H H H H H H
charge: 0
multiplicity: 1
keywords: wb97x-d3
keywords: def2-TZVPP
keywords: def2/J RIJCOSX
keywords: DEFGRID2
keywords: scfconv7
keywords: smallprint printgap noloewdin
keywords: NOSOSCF
formula: C19H26O3
InChI: InChI=1/C19H26O3/c1-7-8-13-12(4)16(10-15(13)20)22-18(21)17-14(9-11(2)3)19(17,5)6/h7,9,14,16-17H,1,8,10H2,2-6H3
48 atoms
O  -0.13946 -0.398792 -1.569699
O  -0.076991 0.293187 0.556367
O  -3.551305 -2.250887 1.091916
C  2.490289 1.804884 -0.507885
C  2.866312 0.629444 0.324301
C  1.878771 0.441794 -0.813176
C  1.648984 2.899437 0.100037
C  3.459161 2.311542 -1.548407
C  4.201252 -0.018293 0.253318
C  0.478093 0.123584 -0.506271
C  4.429134 -1.308263 0.515573
C  -1.504315 -0.806626 -1.459156
C  5.807506 -1.889753 0.44464
C  3.349168 -2.276751 0.886898
C  -1.768214 -1.990965 -0.534684
C  -2.441137 0.277889 -0.991855
C  -3.30774 -0.181846 -0.075074
C  -2.965417 -1.560809 0.278087
C  -2.37216 1.638762 -1.574202
C  -4.408867 0.554899 0.616227
C  -3.905195 1.153326 1.897229
C  -4.286576 0.770655 3.109473
H  2.396434 0.609375 1.304647
H  2.262784 -0.031794 -1.709317
H  1.003821 3.360742 -0.650562
H  1.022475 2.554937 0.919847
H  2.299781 3.681437 0.496033
H  4.174581 3.004446 -1.101316
H  4.023179 1.508514 -2.022246
H  2.926464 2.849804 -2.334172
H  5.044812 0.61307 -0.010925
H  -1.764312 -1.061777 -2.488586
H  6.102674 -2.319075 1.405334
H  5.848895 -2.704954 -0.282286
H  6.553354 -1.147194 0.162075
H  3.288568 -3.083234 0.151215
H  3.571911 -2.753398 1.844813
H  2.363709 -1.820052 0.963211
H  -0.930522 -2.216965 0.12736
H  -1.990596 -2.906059 -1.084906
H  -1.547672 2.204791 -1.131612
H  -3.285592 2.203859 -1.396114
H  -2.188808 1.59978 -2.648896
H  -4.79327 1.344637 -0.033752
H  -5.239467 -0.123661 0.822325
H  -3.160527 1.937332 1.791303
H  -3.88172 1.232351 4.00098
H  -5.022259 -0.011977 3.25544
elementType: O C H
totalener: -965.41494725 hartree
nucrepener: 1844.45577985 hartree
electener: -2809.87072709 hartree
oneelecener: -4975.85811513 hartree
twoeener: 2165.98738803 hartree
cpcmener: -0.03950714 hartree
kineticenergy: 961.00757897 hartree
xcener: -95.144188350006 hartree
chargesum: 0.0000000
charge: -0.301395 -0.499581 -0.491122 0.159971 -0.031570 -0.105639 -0.288549 -0.291426 -0.299774 0.405218 -0.011684 0.295619 -0.229590 -0.241122 -0.154976 -0.002633 -0.124853 0.299183 -0.266015 -0.107424 -0.181037 -0.285253 0.104443 0.091517 0.098349 0.095365 0.101620 0.100472 0.093440 0.098359 0.126897 0.119983 0.096283 0.094961 0.089951 0.099146 0.101667 0.077113 0.114651 0.112489 0.115931 0.109630 0.117547 0.112442 0.091738 0.144011 0.131559 0.114088
qa: -0.3014 -0.4996 -0.4911 0.1600 -0.0316 -0.1056 -0.2885 -0.2914 -0.2998 0.4052 -0.0117 0.2956 -0.2296 -0.2411 -0.1550 -0.0026 -0.1249 0.2992 -0.2660 -0.1074 -0.1810 -0.2853 0.1044 0.0915 0.0983 0.0954 0.1016 0.1005 0.0934 0.0984 0.1269 0.1200 0.0963 0.0950 0.0900 0.0991 0.1017 0.0771 0.1147 0.1125 0.1159 0.1096 0.1175 0.1124 0.0917 0.1440 0.1316 0.1141
va: 2.1297 1.9994 2.0012 3.6860 3.8249 3.8164 3.8892 3.9091 3.8864 4.1361 3.7034 3.7661 3.9295 3.9393 3.8795 3.6783 3.4681 4.0546 3.9451 3.8697 3.7781 3.9457 1.0260 1.0341 0.9996 1.0161 1.0024 0.9992 1.0012 1.0025 1.0026 0.9911 0.9959 0.9963 1.0060 0.9980 0.9997 1.0166 1.0236 1.0215 0.9953 1.0026 1.0006 1.0069 1.0221 1.0005 1.0029 1.0127
dispcorr: -0.024263324 hartree
energy: -965.439210570451
dipole: 17.61884 -16.06185 1.55699 7.81801 -6.56471 1.25330 -0.20353 -2.28587 -2.48940
magnitude: 3.19251 au
magnitude: 8.11471 debye
