program: Orca
programVersion: 5.0.2
elementType: O O O C C C C C C C C C C C C C C C C C C C H H H H H H H H H H H H H H H H H H H H H H H H H H
charge: 0
multiplicity: 1
keywords: wb97x-d3
keywords: def2-TZVPP
keywords: def2/J RIJCOSX
keywords: DEFGRID2
keywords: scfconv7
keywords: smallprint printgap noloewdin
keywords: NOSOSCF
formula: C19H26O3
InChI: InChI=1/C19H26O3/c1-7-8-13-12(4)16(10-15(13)20)22-18(21)17-14(9-11(2)3)19(17,5)6/h7,9,14,16-17H,1,8,10H2,2-6H3
48 atoms
O  -0.12322 -0.327217 -0.80022
O  0.335116 0.264448 -2.910326
O  -3.635384 -2.299991 1.277764
C  2.114378 1.697605 -0.122309
C  2.515372 0.27714 0.119286
C  1.952071 0.676262 -1.237636
C  0.91337 2.242215 0.613533
C  3.165793 2.752797 -0.370132
C  3.920104 -0.16704 0.227854
C  0.652409 0.19925 -1.74206
C  4.334343 -1.356187 0.679181
C  -1.426773 -0.827701 -1.122006
C  5.796125 -1.679654 0.758922
C  3.429341 -2.461272 1.132734
C  -1.745748 -2.006352 -0.214542
C  -2.470707 0.212898 -0.796691
C  -3.360059 -0.237349 0.102273
C  -3.007875 -1.601686 0.505268
C  -2.446901 1.546649 -1.442164
C  -4.512848 0.492024 0.697995
C  -4.154204 1.311362 1.905408
C  -2.933676 1.522419 2.383664
H  1.815428 -0.269879 0.739979
H  2.674324 0.782867 -2.039378
H  0.387919 2.985869 0.010709
H  0.198222 1.476168 0.90694
H  1.24483 2.739375 1.527338
H  3.577623 3.114125 0.574061
H  3.993126 2.395563 -0.981795
H  2.72584 3.6074 -0.887101
H  4.679764 0.539417 -0.093216
H  -1.47104 -1.101734 -2.177595
H  6.043076 -2.537192 0.127649
H  6.421373 -0.841838 0.450205
H  6.080436 -1.956301 1.77771
H  2.370123 -2.247551 1.001952
H  3.649329 -3.379532 0.582336
H  3.597525 -2.689915 2.188611
H  -0.950521 -2.189644 0.510982
H  -1.898906 -2.934185 -0.766686
H  -3.329403 2.134351 -1.197108
H  -2.385003 1.45052 -2.527405
H  -1.57104 2.117528 -1.124235
H  -4.975278 1.150567 -0.043102
H  -5.2957 -0.218492 0.978211
H  -5.001042 1.76803 2.408214
H  -2.78267 2.13656 3.262088
H  -2.044106 1.098859 1.932012
elementType: O C H
totalener: -965.41604881 hartree
nucrepener: 1848.46397460 hartree
electener: -2813.88002342 hartree
oneelecener: -4982.61605756 hartree
twoeener: 2168.73603415 hartree
cpcmener: -0.03808524 hartree
kineticenergy: 960.99554764 hartree
xcener: -95.143696561629 hartree
chargesum: -0.0000000
charge: -0.277882 -0.498670 -0.482510 0.135737 0.010690 -0.089721 -0.284974 -0.299280 -0.291679 0.413915 -0.023378 0.237936 -0.230845 -0.254597 -0.141191 -0.058434 -0.087142 0.317879 -0.255900 -0.069549 -0.184783 -0.281929 0.105562 0.094346 0.103697 0.074697 0.105231 0.101680 0.091824 0.099147 0.119834 0.112721 0.094618 0.089550 0.093461 0.085556 0.095239 0.098467 0.102051 0.105723 0.105686 0.123300 0.121493 0.104727 0.091000 0.134689 0.132289 0.109718
qa: -0.2779 -0.4987 -0.4825 0.1357 0.0107 -0.0897 -0.2850 -0.2993 -0.2917 0.4139 -0.0234 0.2379 -0.2308 -0.2546 -0.1412 -0.0584 -0.0871 0.3179 -0.2559 -0.0695 -0.1848 -0.2819 0.1056 0.0943 0.1037 0.0747 0.1052 0.1017 0.0918 0.0991 0.1198 0.1127 0.0946 0.0895 0.0935 0.0856 0.0952 0.0985 0.1021 0.1057 0.1057 0.1233 0.1215 0.1047 0.0910 0.1347 0.1323 0.1097
va: 2.1149 1.9954 2.0155 3.7193 3.7694 3.8253 3.9071 3.9168 3.8824 4.1744 3.7364 3.7290 3.9284 3.9455 3.9194 3.7329 3.4398 4.0372 3.9316 3.8341 3.8451 3.8924 1.0108 1.0295 0.9956 1.0079 1.0039 0.9998 1.0050 1.0006 1.0108 1.0289 0.9961 1.0077 0.9953 1.0125 0.9973 0.9965 1.0274 1.0215 1.0047 1.0055 0.9913 1.0012 1.0196 1.0006 1.0052 1.0175
dispcorr: -0.024937366 hartree
energy: -965.440986180375
dipole: 16.93176 -15.94393 0.98783 8.32533 -7.07493 1.25040 7.20996 -7.23970 -0.02974
magnitude: 1.59380 au
magnitude: 4.05111 debye
