program: Orca
programVersion: 5.0.2
elementType: O O O C C C C C C C C C C C C C C C C C C C H H H H H H H H H H H H H H H H H H H H H H H H H H
charge: 0
multiplicity: 1
keywords: wb97x-d3
keywords: def2-TZVPP
keywords: def2/J RIJCOSX
keywords: DEFGRID2
keywords: scfconv7
keywords: smallprint printgap noloewdin
keywords: NOSOSCF
formula: C19H26O3
InChI: InChI=1/C19H26O3/c1-7-8-13-12(4)16(10-15(13)20)22-18(21)17-14(9-11(2)3)19(17,5)6/h7,9,14,16-17H,1,8,10H2,2-6H3
48 atoms
O  0.001875 -0.207276 -0.658118
O  0.203122 0.535212 -2.759972
O  -3.620248 -2.018546 1.533338
C  2.545284 1.488166 -0.198919
C  2.833994 0.016915 -0.164337
C  2.096848 0.603713 -1.352045
C  1.548848 2.047216 0.787362
C  3.654444 2.461568 -0.516087
C  4.188947 -0.534759 -0.37168
C  0.686344 0.317286 -1.669814
C  4.817007 -1.407513 0.42316
C  -1.387407 -0.516093 -0.81094
C  6.193166 -1.898449 0.088019
C  4.246402 -1.975977 1.686626
C  -1.73465 -1.734106 0.031466
C  -2.25303 0.597279 -0.270719
C  -3.129952 0.141277 0.638799
C  -2.932945 -1.297972 0.835965
C  -2.124391 1.979877 -0.789522
C  -4.227872 0.876224 1.338365
C  -5.530107 0.670339 0.620925
C  -6.56411 -0.002464 1.110165
H  2.208871 -0.533469 0.529436
H  2.684976 0.730124 -2.254601
H  1.000992 2.888801 0.358381
H  0.827094 1.313628 1.138321
H  2.081845 2.419194 1.6644
H  3.238526 3.409355 -0.862477
H  4.246048 2.668634 0.37776
H  4.332229 2.09935 -1.288019
H  4.712595 -0.191958 -1.259602
H  -1.616228 -0.683491 -1.865527
H  6.905447 -1.633687 0.873779
H  6.212201 -2.988752 0.011394
H  6.560417 -1.488049 -0.852337
H  4.125134 -3.059087 1.601681
H  4.931606 -1.810183 2.521607
H  3.283004 -1.553425 1.964033
H  -0.921972 -1.993277 0.714085
H  -1.957441 -2.61996 -0.563045
H  -1.129918 2.385225 -0.590637
H  -2.853314 2.654648 -0.346088
H  -2.260726 1.994007 -1.87261
H  -4.308695 0.525274 2.369317
H  -3.994901 1.942179 1.381386
H  -5.589595 1.097035 -0.376173
H  -7.475731 -0.127967 0.540161
H  -6.540093 -0.449265 2.097306
elementType: O C H
totalener: -965.41664367 hartree
nucrepener: 1805.13645557 hartree
electener: -2770.55309925 hartree
oneelecener: -4896.04320312 hartree
twoeener: 2125.49010387 hartree
cpcmener: -0.03892044 hartree
kineticenergy: 961.00224663 hartree
xcener: -95.142907186318 hartree
chargesum: -0.0000000
charge: -0.276331 -0.497383 -0.485502 0.125905 0.071668 -0.133455 -0.310112 -0.272631 -0.310248 0.424954 -0.039848 0.213452 -0.222382 -0.256586 -0.134540 -0.022801 -0.073530 0.306946 -0.256378 -0.111300 -0.178622 -0.287109 0.101725 0.090533 0.103690 0.093991 0.104400 0.098342 0.096292 0.089491 0.122854 0.111358 0.094388 0.093308 0.088503 0.098521 0.095171 0.090277 0.106060 0.101396 0.120350 0.105007 0.118114 0.099124 0.111548 0.145232 0.131601 0.114558
qa: -0.2763 -0.4974 -0.4855 0.1259 0.0717 -0.1335 -0.3101 -0.2726 -0.3102 0.4250 -0.0398 0.2135 -0.2224 -0.2566 -0.1345 -0.0228 -0.0735 0.3069 -0.2564 -0.1113 -0.1786 -0.2871 0.1017 0.0905 0.1037 0.0940 0.1044 0.0983 0.0963 0.0895 0.1229 0.1114 0.0944 0.0933 0.0885 0.0985 0.0952 0.0903 0.1061 0.1014 0.1204 0.1050 0.1181 0.0991 0.1115 0.1452 0.1316 0.1146
va: 2.1146 1.9950 2.0063 3.6514 3.7309 3.8902 3.9090 3.9089 3.8603 4.1497 3.7498 3.7749 3.9231 3.9442 3.9401 3.7281 3.4438 4.0465 3.9396 3.8686 3.7759 3.9525 1.0190 1.0347 0.9944 1.0127 1.0032 1.0015 1.0022 1.0056 1.0096 1.0296 0.9962 0.9958 1.0088 0.9962 0.9977 1.0097 1.0247 1.0240 0.9918 1.0058 1.0035 1.0189 1.0049 0.9996 1.0029 1.0127
dispcorr: -0.023355497 hartree
energy: -965.439999171080
dipole: 17.54689 -15.91386 1.63303 6.37475 -5.04663 1.32812 6.18425 -5.95060 0.23365
magnitude: 2.11785 au
magnitude: 5.38315 debye
