program: Orca
programVersion: 5.0.2
elementType: O O O C C C C C C C C C C C C C C C C C C C H H H H H H H H H H H H H H H H H H H H H H H H H H
charge: 0
multiplicity: 1
keywords: wb97x-d3
keywords: def2-TZVPP
keywords: def2/J RIJCOSX
keywords: DEFGRID2
keywords: scfconv7
keywords: smallprint printgap noloewdin
keywords: NOSOSCF
formula: C19H26O3
InChI: InChI=1/C19H26O3/c1-7-8-13-12(4)16(10-15(13)20)22-18(21)17-14(9-11(2)3)19(17,5)6/h7,9,14,16-17H,1,8,10H2,2-6H3
48 atoms
O  -0.216162 -0.345367 -1.574735
O  -0.079211 0.108341 0.612921
O  -3.762319 -2.364898 0.83017
C  2.403926 1.780588 -0.427486
C  2.831648 0.570956 0.327817
C  1.825137 0.42003 -0.798682
C  1.547534 2.811249 0.265869
C  3.330751 2.377782 -1.458313
C  4.186794 -0.023347 0.209236
C  0.435813 0.058824 -0.481596
C  4.491657 -1.280134 0.543627
C  -1.588155 -0.732906 -1.484961
C  5.892904 -1.799083 0.443192
C  3.482081 -2.267753 1.041813
C  -1.886706 -1.982151 -0.662101
C  -2.508534 0.329391 -0.939158
C  -3.422076 -0.194236 -0.105036
C  -3.120063 -1.608406 0.125651
C  -2.395799 1.734667 -1.39353
C  -4.57879 0.483656 0.546335
C  -4.293113 1.071537 1.896977
C  -3.111866 1.13482 2.498616
H  2.379808 0.481901 1.312326
H  2.195653 0.012359 -1.732177
H  0.872209 3.300528 -0.439135
H  0.950712 2.398237 1.07632
H  2.186661 3.584374 0.696621
H  4.044948 3.055201 -0.986144
H  3.896104 1.623556 -2.005111
H  2.762561 2.956378 -2.188625
H  4.982553 0.6244 -0.147069
H  -1.857164 -0.899844 -2.530266
H  6.591999 -1.035356 0.103377
H  6.242042 -2.171982 1.40935
H  5.948554 -2.642259 -0.249957
H  3.719842 -2.581121 2.061801
H  2.462959 -1.884423 1.039811
H  3.49951 -3.174376 0.432263
H  -1.078958 -2.250732 0.02049
H  -2.081609 -2.856086 -1.284448
H  -1.515021 2.212827 -0.956745
H  -3.263197 2.327128 -1.109014
H  -2.276792 1.786889 -2.477019
H  -4.965541 1.277106 -0.099933
H  -5.405196 -0.226545 0.646911
H  -5.161948 1.483955 2.400755
H  -3.012959 1.589062 3.475914
H  -2.20641 0.744142 2.052528
elementType: O C H
totalener: -965.41565852 hartree
nucrepener: 1851.51149520 hartree
electener: -2816.92715372 hartree
oneelecener: -4989.89452422 hartree
twoeener: 2172.96737051 hartree
cpcmener: -0.03780001 hartree
kineticenergy: 960.99906231 hartree
xcener: -95.145081444712 hartree
chargesum: 0.0000000
charge: -0.300905 -0.505762 -0.489406 0.168753 -0.044823 -0.094612 -0.288721 -0.296561 -0.289378 0.410660 -0.013335 0.305350 -0.229481 -0.244651 -0.161201 -0.006218 -0.147890 0.319472 -0.258111 -0.091894 -0.186362 -0.289069 0.102317 0.091100 0.098419 0.095346 0.103537 0.101824 0.092005 0.098939 0.127273 0.122630 0.089588 0.094908 0.095800 0.101714 0.077200 0.096496 0.115593 0.109463 0.115964 0.106144 0.119946 0.104670 0.092139 0.134641 0.131706 0.114780
qa: -0.3009 -0.5058 -0.4894 0.1688 -0.0448 -0.0946 -0.2887 -0.2966 -0.2894 0.4107 -0.0133 0.3054 -0.2295 -0.2447 -0.1612 -0.0062 -0.1479 0.3195 -0.2581 -0.0919 -0.1864 -0.2891 0.1023 0.0911 0.0984 0.0953 0.1035 0.1018 0.0920 0.0989 0.1273 0.1226 0.0896 0.0949 0.0958 0.1017 0.0772 0.0965 0.1156 0.1095 0.1160 0.1061 0.1199 0.1047 0.0921 0.1346 0.1317 0.1148
va: 2.1341 1.9853 2.0067 3.6897 3.8325 3.8234 3.8873 3.9114 3.8771 4.1118 3.7051 3.7363 3.9285 3.9418 3.8801 3.6706 3.4614 4.0304 3.9447 3.8381 3.8331 3.8899 1.0260 1.0340 0.9998 1.0139 1.0026 0.9986 1.0013 1.0022 1.0025 0.9925 1.0066 0.9955 0.9963 0.9984 1.0182 0.9986 1.0243 1.0235 0.9947 1.0032 0.9998 1.0018 1.0157 0.9999 1.0046 1.0231
dispcorr: -0.024851939 hartree
energy: -965.440510456683
dipole: 18.82492 -17.39352 1.43139 8.86527 -7.37247 1.49279 0.47226 -2.79238 -2.32012
magnitude: 3.10810 au
magnitude: 7.90016 debye
