program: Orca
programVersion: 5.0.2
elementType: O O O C C C C C C C C C C C C C C C C C C C H H H H H H H H H H H H H H H H H H H H H H H H H H
charge: 0
multiplicity: 1
keywords: wb97x-d3
keywords: def2-TZVPP
keywords: def2/J RIJCOSX
keywords: DEFGRID2
keywords: scfconv7
keywords: smallprint printgap noloewdin
keywords: NOSOSCF
formula: C19H26O3
InChI: InChI=1/C19H26O3/c1-7-8-13-12(4)16(10-15(13)20)22-18(21)17-14(9-11(2)3)19(17,5)6/h7,9,14,16-17H,1,8,10H2,2-6H3
48 atoms
O  -0.240701 -0.393998 -1.560436
O  -0.067073 0.037571 0.628943
O  -3.799234 -2.378946 0.863476
C  2.376709 1.741924 -0.419401
C  2.840284 0.517712 0.290582
C  1.806387 0.384942 -0.815558
C  1.528043 2.741131 0.327604
C  3.264507 2.384444 -1.457666
C  4.199987 -0.05116 0.125076
C  0.42827 0.003017 -0.475347
C  4.576296 -1.257137 0.559786
C  -1.615628 -0.766827 -1.456133
C  5.987072 -1.736312 0.406449
C  3.646159 -2.220878 1.230455
C  -1.924113 -2.013545 -0.633091
C  -2.518128 0.305439 -0.901236
C  -3.436343 -0.20911 -0.066379
C  -3.150299 -1.626799 0.160341
C  -2.388384 1.713714 -1.341674
C  -4.583404 0.489166 0.581942
C  -4.26442 1.181003 1.874801
C  -3.071586 1.280719 2.448218
H  2.414051 0.394707 1.282342
H  2.158253 0.009613 -1.769509
H  0.96661 2.300635 1.14858
H  2.170286 3.514305 0.753591
H  0.821128 3.23545 -0.342092
H  3.815324 1.657388 -2.05359
H  2.666624 2.985222 -2.145012
H  3.989624 3.049721 -0.984946
H  4.943361 0.575546 -0.358533
H  -1.897372 -0.928684 -2.498912
H  6.421036 -1.989673 1.377201
H  6.02832 -2.647523 -0.195703
H  6.627338 -0.990159 -0.063419
H  2.604661 -1.901313 1.210093
H  3.703726 -3.202557 0.752731
H  3.931462 -2.371814 2.275948
H  -1.116164 -2.29148 0.045401
H  -2.132584 -2.884676 -1.255399
H  -1.534398 2.191065 -0.85148
H  -3.273081 2.299896 -1.096848
H  -2.21218 1.776654 -2.417042
H  -5.009119 1.227471 -0.104748
H  -5.390787 -0.227115 0.762638
H  -5.120111 1.639618 2.361033
H  -2.951603 1.80671 3.386622
H  -2.178125 0.845378 2.019145
elementType: O C H
totalener: -965.41555544 hartree
nucrepener: 1848.54884737 hartree
electener: -2813.96440281 hartree
oneelecener: -4983.94043650 hartree
twoeener: 2169.97603369 hartree
cpcmener: -0.03754949 hartree
kineticenergy: 960.98821235 hartree
xcener: -95.143036857624 hartree
chargesum: 0.0000000
charge: -0.301219 -0.505290 -0.490133 0.166934 -0.052923 -0.080265 -0.288049 -0.298591 -0.279479 0.406001 -0.014557 0.304260 -0.230806 -0.251215 -0.161752 -0.014253 -0.139711 0.320323 -0.261484 -0.091140 -0.185846 -0.287646 0.101876 0.091424 0.095221 0.103718 0.098604 0.090587 0.099370 0.103042 0.127005 0.122840 0.094949 0.095843 0.089516 0.079998 0.095445 0.101726 0.115647 0.109314 0.116488 0.108138 0.121069 0.105469 0.090472 0.134005 0.131279 0.113797
qa: -0.3012 -0.5053 -0.4901 0.1669 -0.0529 -0.0803 -0.2880 -0.2986 -0.2795 0.4060 -0.0146 0.3043 -0.2308 -0.2512 -0.1618 -0.0143 -0.1397 0.3203 -0.2615 -0.0911 -0.1858 -0.2876 0.1019 0.0914 0.0952 0.1037 0.0986 0.0906 0.0994 0.1030 0.1270 0.1228 0.0949 0.0958 0.0895 0.0800 0.0954 0.1017 0.1156 0.1093 0.1165 0.1081 0.1211 0.1055 0.0905 0.1340 0.1313 0.1138
va: 2.1348 1.9846 2.0068 3.7057 3.8356 3.8283 3.8860 3.9150 3.8780 4.1164 3.7033 3.7398 3.9286 3.9444 3.8778 3.6739 3.4556 4.0264 3.9410 3.8389 3.8377 3.8897 1.0234 1.0342 1.0138 1.0026 0.9996 1.0015 1.0019 0.9984 1.0030 0.9928 0.9951 0.9961 1.0071 1.0160 0.9987 0.9975 1.0252 1.0238 0.9939 1.0024 1.0010 1.0007 1.0182 1.0000 1.0047 1.0225
dispcorr: -0.024748071 hartree
energy: -965.440303509006
dipole: 19.17324 -17.74293 1.43031 9.34964 -7.81637 1.53327 0.72178 -3.01643 -2.29465
magnitude: 3.10840 au
magnitude: 7.90092 debye
