program: Orca
programVersion: 5.0.2
elementType: O O O C C C C C C C C C C C C C C C C C C C H H H H H H H H H H H H H H H H H H H H H H H H H H
charge: 0
multiplicity: 1
keywords: wb97x-d3
keywords: def2-TZVPP
keywords: def2/J RIJCOSX
keywords: DEFGRID2
keywords: scfconv7
keywords: smallprint printgap noloewdin
keywords: NOSOSCF
formula: C19H26O3
InChI: InChI=1/C19H26O3/c1-7-8-13-12(4)16(10-15(13)20)22-18(21)17-14(9-11(2)3)19(17,5)6/h7,9,14,16-17H,1,8,10H2,2-6H3
48 atoms
O  -0.434721 -0.353315 -1.668903
O  -0.18997 -0.256888 0.554236
O  -4.21824 -2.297878 0.441256
C  2.40097 1.319146 -0.389687
C  2.763307 -0.018635 0.181933
C  1.698022 0.061899 -0.883537
C  1.67567 2.308974 0.486961
C  3.340398 1.971694 -1.37317
C  4.043383 -0.692107 -0.141399
C  0.28643 -0.199099 -0.556357
C  5.067578 -0.85901 0.700232
C  -1.842008 -0.580641 -1.590849
C  6.31335 -1.572271 0.269412
C  5.082573 -0.35974 2.112138
C  -2.283166 -1.900442 -0.967089
C  -2.616757 0.4817 -0.85475
C  -3.593512 -0.057008 -0.105866
C  -3.474559 -1.516375 -0.122239
C  -2.329538 1.919033 -1.06754
C  -4.656468 0.648744 0.664632
C  -4.274267 1.039562 2.06183
C  -3.081795 0.89353 2.626013
H  2.384329 -0.187048 1.185493
H  1.989365 -0.251872 -1.880257
H  1.080833 1.83889 1.267259
H  2.402288 2.956852 0.980931
H  1.016368 2.948832 -0.10369
H  2.808919 2.704371 -1.983009
H  4.137287 2.498527 -0.844208
H  3.807472 1.255272 -2.048038
H  4.145444 -1.075871 -1.152578
H  -2.146271 -0.544357 -2.639292
H  6.511863 -2.435294 0.910022
H  6.251135 -1.924054 -0.760191
H  7.186582 -0.920119 0.352211
H  5.233807 -1.184003 2.813678
H  5.91934 0.327189 2.26243
H  4.172242 0.163467 2.399175
H  -1.516844 -2.351199 -0.334249
H  -2.562518 -2.646277 -1.711796
H  -3.129418 2.555091 -0.692698
H  -2.176801 2.135633 -2.12625
H  -1.411121 2.210364 -0.550663
H  -4.9733 1.549462 0.130097
H  -5.55021 0.019453 0.713351
H  -5.075294 1.494218 2.636597
H  -2.907497 1.217684 3.64385
H  -2.241329 0.449041 2.108468
elementType: O C H
totalener: -965.41621041 hartree
nucrepener: 1831.67204275 hartree
electener: -2797.08825316 hartree
oneelecener: -4950.12997682 hartree
twoeener: 2153.04172366 hartree
cpcmener: -0.03848157 hartree
kineticenergy: 960.99828305 hartree
xcener: -95.144832403686 hartree
chargesum: 0.0000000
charge: -0.298109 -0.496717 -0.489921 0.165101 0.007118 -0.136170 -0.309079 -0.267462 -0.284408 0.415254 -0.031220 0.297297 -0.228558 -0.252395 -0.157633 -0.018410 -0.134828 0.322479 -0.261468 -0.089289 -0.186324 -0.287744 0.096781 0.090113 0.096727 0.104440 0.098635 0.098606 0.096290 0.091494 0.123736 0.122646 0.094722 0.089453 0.094435 0.097506 0.096382 0.088786 0.113917 0.107089 0.107907 0.121526 0.116570 0.105454 0.089919 0.134993 0.131849 0.112510
qa: -0.2981 -0.4967 -0.4899 0.1651 0.0071 -0.1362 -0.3091 -0.2675 -0.2844 0.4153 -0.0312 0.2973 -0.2286 -0.2524 -0.1576 -0.0184 -0.1348 0.3225 -0.2615 -0.0893 -0.1863 -0.2877 0.0968 0.0901 0.0967 0.1044 0.0986 0.0986 0.0963 0.0915 0.1237 0.1226 0.0947 0.0895 0.0944 0.0975 0.0964 0.0888 0.1139 0.1071 0.1079 0.1215 0.1166 0.1055 0.0899 0.1350 0.1318 0.1125
va: 2.1364 2.0020 2.0068 3.6445 3.7841 3.9079 3.9052 3.9020 3.8724 4.1333 3.7076 3.7439 3.9256 3.9439 3.8813 3.6774 3.4528 4.0261 3.9415 3.8371 3.8354 3.8895 1.0264 1.0400 1.0138 1.0029 0.9993 1.0027 1.0029 1.0030 1.0070 0.9933 0.9954 1.0081 0.9961 0.9975 0.9972 1.0083 1.0264 1.0248 1.0028 1.0001 0.9943 1.0008 1.0180 0.9999 1.0045 1.0245
dispcorr: -0.024510099 hartree
energy: -965.440720511343
dipole: 23.52650 -21.78660 1.73990 11.88241 -9.89405 1.98836 3.76182 -5.69856 -1.93674
magnitude: 3.27594 au
magnitude: 8.32678 debye
