program: Orca
programVersion: 5.0.2
elementType: O O O C C C C C C C C C C C C C C C C C C C C C C H H H H H H H H H H H H H H H H H H H H H H H H H H
charge: 0
multiplicity: 1
keywords: wb97x-d3
keywords: def2-TZVPP
keywords: def2/J RIJCOSX
keywords: DEFGRID2
keywords: scfconv7
keywords: smallprint printgap noloewdin
keywords: NOSOSCF
formula: C22H26O3
InChI: InChI=1/C22H26O3/c1-15(2)10-19-20(22(19,3)4)21(23)25-14-17-12-18(24-13-17)11-16-8-6-5-7-9-16/h5-10,12-13,19-20H,11,14H2,1-4H3
51 atoms
O  -1.824847 2.302094 0.754467
O  -1.801878 1.331794 -1.259224
O  2.535039 2.307105 0.674445
C  -4.070085 -0.468611 -0.105726
C  -2.762497 -1.161133 0.096346
C  -2.936436 0.279377 0.566203
C  -4.494173 -0.13414 -1.515717
C  -5.242088 -0.806989 0.787058
C  -2.551758 -2.24457 1.075762
C  -2.14411 1.331042 -0.104122
C  -1.450037 -2.989436 1.195862
C  -1.370237 -4.085273 2.215972
C  -0.214808 -2.819385 0.365751
C  -0.954021 3.335596 0.282021
C  0.455115 2.873482 0.146851
C  1.112638 2.36626 -1.018257
C  1.378896 2.811237 1.135455
C  2.369189 2.039637 -0.639613
C  3.506798 1.408292 -1.35752
C  3.693544 -0.038899 -0.966527
C  2.836064 -1.012585 -1.468775
C  4.694885 -0.420518 -0.083289
C  2.983718 -2.340856 -1.104944
C  4.842518 -1.749719 0.288401
C  3.987197 -2.713764 -0.221454
H  -2.168767 -1.233904 -0.80867
H  -3.04539 0.416759 1.63573
H  -3.653915 0.051937 -2.178092
H  -5.069169 -0.965401 -1.927487
H  -5.1352 0.748943 -1.531828
H  -4.959645 -0.952472 1.829234
H  -5.978485 -0.002283 0.762446
H  -5.735708 -1.718698 0.445299
H  -3.371935 -2.453684 1.755504
H  -2.287155 -4.174252 2.797428
H  -0.545228 -3.9143 2.911948
H  -1.181099 -5.051383 1.740951
H  -0.262067 -1.982827 -0.32776
H  -0.007697 -3.725923 -0.209587
H  0.656878 -2.653621 1.002852
H  -1.031825 4.117128 1.036992
H  -1.320876 3.742368 -0.661874
H  0.685701 2.249719 -2.000248
H  1.349414 3.082933 2.178624
H  4.428324 1.967151 -1.173584
H  3.309476 1.482427 -2.428658
H  2.042224 -0.726429 -2.149015
H  5.366903 0.327868 0.319225
H  2.31249 -3.087017 -1.510005
H  5.628077 -2.030916 0.977588
H  4.102334 -3.750936 0.064671
totalener: -1079.73142151 hartree
nucrepener: 2160.85720950 hartree
electener: -3240.58863101 hartree
oneelecener: -5760.23637964 hartree
twoeener: 2519.64774863 hartree
kineticenergy: 1074.92095587 hartree
xcener: -106.469305210152 hartree
chargesum: 0.0000000
charge: -0.264012 -0.413663 -0.249466 0.110576 -0.023645 -0.052857 -0.251342 -0.278459 -0.176376 0.364379 -0.018922 -0.215039 -0.254085 0.048441 -0.073576 -0.239310 -0.031845 0.217776 -0.141810 0.086168 -0.150771 -0.151425 -0.161351 -0.119800 -0.122824 0.092655 0.075257 0.099868 0.083148 0.082185 0.072796 0.091387 0.098803 0.078893 0.076154 0.086235 0.083368 0.081833 0.079990 0.092466 0.104561 0.108220 0.136466 0.135002 0.098766 0.109041 0.114172 0.106310 0.128652 0.122658 0.124352
qa: -0.2640 -0.4137 -0.2495 0.1106 -0.0236 -0.0529 -0.2513 -0.2785 -0.1764 0.3644 -0.0189 -0.2150 -0.2541 0.0484 -0.0736 -0.2393 -0.0318 0.2178 -0.1418 0.0862 -0.1508 -0.1514 -0.1614 -0.1198 -0.1228 0.0927 0.0753 0.0999 0.0831 0.0822 0.0728 0.0914 0.0988 0.0789 0.0762 0.0862 0.0834 0.0818 0.0800 0.0925 0.1046 0.1082 0.1365 0.1350 0.0988 0.1090 0.1142 0.1063 0.1287 0.1227 0.1244
va: 2.1345 2.0858 2.3105 3.7839 3.8371 3.8236 3.8931 3.9208 3.9129 4.1933 3.8487 3.9366 3.9586 3.8987 3.6930 4.0193 3.9971 3.6123 3.8903 3.6194 3.9641 4.0104 3.9518 3.9630 3.9386 1.0240 1.0355 1.0246 1.0007 1.0034 1.0074 1.0047 1.0004 1.0166 1.0118 0.9985 0.9976 1.0135 0.9971 0.9963 0.9960 1.0058 1.0256 1.0067 1.0119 1.0077 1.0112 1.0124 0.9947 1.0002 1.0002
dispcorr: -0.024411857 hartree
energy: -1079.755833367806
dipole: -15.67392 15.63474 -0.03918 -18.61536 18.52658 -0.08879 2.38784 -1.97376 0.41409
magnitude: 0.42531 au
magnitude: 1.08104 debye
