program: Orca
programVersion: 5.0.2
elementType: O O O C C C C C C C C C C C C C C C C C C C C C C H H H H H H H H H H H H H H H H H H H H H H H H H H
charge: 0
multiplicity: 1
keywords: wb97x-d3
keywords: def2-TZVPP
keywords: def2/J RIJCOSX
keywords: DEFGRID2
keywords: scfconv7
keywords: smallprint printgap noloewdin
keywords: NOSOSCF
formula: C22H26O3
InChI: InChI=1/C22H26O3/c1-15(2)10-19-20(22(19,3)4)21(23)25-14-17-12-18(24-13-17)11-16-8-6-5-7-9-16/h5-10,12-13,19-20H,11,14H2,1-4H3
51 atoms
O  -1.640641 1.857998 -0.528312
O  -1.466936 1.32611 1.637499
O  2.614977 2.187478 0.464604
C  -1.971326 -1.547534 0.445694
C  -3.180511 -1.046099 1.180667
C  -2.542191 -0.178202 0.122231
C  -0.671575 -1.680902 1.201109
C  -2.143269 -2.604159 -0.619333
C  -4.529739 -1.603531 0.957289
C  -1.834538 1.05742 0.522676
C  -5.337674 -2.125554 1.882851
C  -6.689357 -2.659588 1.512584
C  -4.999273 -2.241348 3.338238
C  -0.861622 3.037462 -0.301986
C  0.593732 2.729764 -0.26751
C  1.475869 2.586253 -1.385121
C  1.350674 2.469061 0.824511
C  2.687418 2.25584 -0.881433
C  3.988868 1.91466 -1.51437
C  4.271059 0.431589 -1.460503
C  4.943081 -0.128288 -0.380346
C  3.821886 -0.406258 -2.475108
C  5.164819 -1.49606 -0.317453
C  4.04313 -1.773271 -2.417151
C  4.715797 -2.323177 -1.335786
H  -2.970422 -0.712286 2.190951
H  -3.053513 -0.111909 -0.832281
H  -0.604512 -2.680124 1.635649
H  0.183821 -1.553844 0.534635
H  -0.57387 -0.961304 2.01008
H  -3.053687 -2.474948 -1.20243
H  -1.301442 -2.586082 -1.313102
H  -2.182919 -3.596777 -0.167763
H  -4.891987 -1.583813 -0.066638
H  -7.480921 -2.143908 2.061806
H  -6.775811 -3.719285 1.765538
H  -6.897111 -2.552007 0.448729
H  -5.023766 -3.287298 3.65423
H  -5.736314 -1.715644 3.95027
H  -4.017303 -1.848156 3.590216
H  -1.181368 3.536377 0.613724
H  -1.097003 3.690201 -1.141788
H  1.230262 2.710272 -2.427862
H  1.121707 2.440391 1.876714
H  4.798854 2.468927 -1.032256
H  3.958171 2.251242 -2.551961
H  5.295665 0.509386 0.421214
H  3.291091 0.015592 -3.320635
H  5.689686 -1.916529 0.53039
H  3.691024 -2.410012 -3.218236
H  4.891741 -3.389707 -1.288489
totalener: -1079.73295379 hartree
nucrepener: 2096.03342720 hartree
electener: -3175.76638099 hartree
oneelecener: -5630.54005457 hartree
twoeener: 2454.77367358 hartree
kineticenergy: 1074.91362222 hartree
xcener: -106.466919813445 hartree
chargesum: 0.0000000
charge: -0.262832 -0.402668 -0.252757 0.099192 0.036503 -0.107389 -0.260329 -0.240398 -0.188402 0.357496 -0.045630 -0.206093 -0.236681 0.059867 -0.077637 -0.277048 0.003967 0.222810 -0.139714 0.103384 -0.162373 -0.172076 -0.118639 -0.121283 -0.138088 0.089435 0.069971 0.083864 0.091712 0.095058 0.069108 0.092810 0.089919 0.072680 0.084463 0.083271 0.076087 0.083849 0.086523 0.083518 0.113278 0.099632 0.123592 0.149209 0.105553 0.098651 0.109680 0.103267 0.123367 0.123694 0.124625
qa: -0.2628 -0.4027 -0.2528 0.0992 0.0365 -0.1074 -0.2603 -0.2404 -0.1884 0.3575 -0.0456 -0.2061 -0.2367 0.0599 -0.0776 -0.2770 0.0040 0.2228 -0.1397 0.1034 -0.1624 -0.1721 -0.1186 -0.1213 -0.1381 0.0894 0.0700 0.0839 0.0917 0.0951 0.0691 0.0928 0.0899 0.0727 0.0845 0.0833 0.0761 0.0838 0.0865 0.0835 0.1133 0.0996 0.1236 0.1492 0.1056 0.0987 0.1097 0.1033 0.1234 0.1237 0.1246
va: 2.1354 2.0988 2.3133 3.7443 3.7747 3.9045 3.9137 3.9082 3.8955 4.2307 3.8110 3.9367 3.9471 3.8749 3.6893 4.0573 3.9674 3.6256 3.8903 3.5985 4.0185 4.0097 3.9532 3.9619 3.9652 1.0365 1.0388 1.0020 1.0021 1.0221 1.0110 1.0046 1.0051 1.0197 0.9981 0.9982 1.0121 0.9995 0.9991 1.0149 1.0096 0.9944 1.0173 1.0140 1.0092 1.0115 1.0157 1.0124 1.0003 1.0002 1.0000
dispcorr: -0.022547519 hartree
energy: -1079.755501308813
dipole: -21.06453 21.00493 -0.05960 -20.21261 19.94411 -0.26850 5.20792 -5.78569 -0.57777
magnitude: 0.63989 au
magnitude: 1.62648 debye
