program: Orca
programVersion: 5.0.2
elementType: O O O C C C C C C C C C C C C C C C C C C C C C C H H H H H H H H H H H H H H H H H H H H H H H H H H
charge: 0
multiplicity: 1
keywords: wb97x-d3
keywords: def2-TZVPP
keywords: def2/J RIJCOSX
keywords: DEFGRID2
keywords: scfconv7
keywords: smallprint printgap noloewdin
keywords: NOSOSCF
formula: C22H26O3
InChI: InChI=1/C22H26O3/c1-15(2)10-19-20(22(19,3)4)21(23)25-14-17-12-18(24-13-17)11-16-8-6-5-7-9-16/h5-10,12-13,19-20H,11,14H2,1-4H3
51 atoms
O  -1.293035 1.595183 1.342352
O  -2.492861 2.095045 -0.479314
O  1.578436 2.075251 -1.960051
C  -4.465348 -0.066457 0.659484
C  -3.595454 -0.668909 -0.39057
C  -2.958874 0.097976 0.752248
C  -5.345893 1.105456 0.301148
C  -5.075268 -0.973428 1.701934
C  -3.388515 -2.134998 -0.508499
C  -2.261772 1.364931 0.450288
C  -2.224006 -2.732348 -0.767025
C  -2.12216 -4.224018 -0.873793
C  -0.936861 -1.991399 -0.970794
C  -0.398593 2.674622 1.058636
C  0.579334 2.290774 0.006531
C  1.696868 1.406194 0.145101
C  0.560854 2.65247 -1.296567
C  2.264319 1.312973 -1.079973
C  3.437198 0.55962 -1.604357
C  4.107367 -0.2301 -0.514163
C  5.176456 0.306202 0.193862
C  3.64319 -1.494916 -0.168409
C  5.773711 -0.4051 1.223989
C  4.236695 -2.209425 0.861143
C  5.304611 -1.665916 1.560272
H  -3.589044 -0.122177 -1.330871
H  -2.479072 -0.503092 1.515999
H  -4.919178 1.729709 -0.479456
H  -6.313974 0.743145 -0.050079
H  -5.528497 1.735956 1.173561
H  -4.419821 -1.802495 1.968943
H  -5.294156 -0.41611 2.61426
H  -6.014966 -1.397116 1.341072
H  -4.271197 -2.758764 -0.39533
H  -1.763641 -4.524569 -1.861377
H  -3.079468 -4.714205 -0.700737
H  -1.405885 -4.620218 -0.149385
H  -0.479061 -2.280429 -1.920107
H  -0.215107 -2.243012 -0.188953
H  -1.053717 -0.910685 -0.978726
H  0.105211 2.871842 2.004468
H  -0.950236 3.572026 0.775065
H  2.028909 0.908019 1.041525
H  -0.106042 3.277734 -1.867082
H  4.151712 1.25338 -2.058196
H  3.115727 -0.109528 -2.409115
H  5.544933 1.292357 -0.06243
H  2.806717 -1.92236 -0.709307
H  6.60747 0.025589 1.762807
H  3.866488 -3.193778 1.11631
H  5.770063 -2.223981 2.361869
totalener: -1079.73228438 hartree
nucrepener: 2138.03979603 hartree
electener: -3217.77208041 hartree
oneelecener: -5714.38577132 hartree
twoeener: 2496.61369090 hartree
kineticenergy: 1074.91282802 hartree
xcener: -106.467573101656 hartree
chargesum: 0.0000000
charge: -0.261533 -0.399556 -0.256263 0.130288 -0.018254 -0.109578 -0.260712 -0.271052 -0.242013 0.333895 -0.000853 -0.214505 -0.222162 0.067378 -0.087081 -0.265344 0.012708 0.172095 -0.047427 0.026540 -0.149845 -0.163778 -0.123521 -0.121211 -0.127544 0.105406 0.087755 0.102188 0.081159 0.083860 0.084867 0.090810 0.089052 0.093163 0.086955 0.079340 0.083090 0.088058 0.083763 0.087875 0.104104 0.107451 0.135557 0.145626 0.091148 0.095188 0.109395 0.108132 0.125068 0.124254 0.126061
qa: -0.2615 -0.3996 -0.2563 0.1303 -0.0183 -0.1096 -0.2607 -0.2711 -0.2420 0.3339 -0.0009 -0.2145 -0.2222 0.0674 -0.0871 -0.2653 0.0127 0.1721 -0.0474 0.0265 -0.1498 -0.1638 -0.1235 -0.1212 -0.1275 0.1054 0.0878 0.1022 0.0812 0.0839 0.0849 0.0908 0.0891 0.0932 0.0870 0.0793 0.0831 0.0881 0.0838 0.0879 0.1041 0.1075 0.1356 0.1456 0.0911 0.0952 0.1094 0.1081 0.1251 0.1243 0.1261
va: 2.1191 2.0955 2.3016 3.7262 3.8196 3.8285 3.9023 3.9082 3.8982 4.2072 3.7525 3.9408 3.9489 3.8752 3.7012 3.9934 3.9772 3.6797 3.8525 3.6653 3.9879 3.9791 3.9621 3.9568 3.9565 1.0270 1.0313 1.0224 1.0021 1.0021 1.0052 1.0064 1.0017 1.0097 0.9987 1.0100 0.9988 1.0011 1.0014 1.0096 0.9913 1.0115 1.0105 1.0135 1.0093 1.0058 1.0113 1.0119 1.0004 1.0007 0.9997
dispcorr: -0.024545332 hartree
energy: -1079.756829710163
dipole: -16.43670 16.85487 0.41817 -16.35066 15.79427 -0.55639 2.78509 -2.31235 0.47273
magnitude: 0.84138 au
magnitude: 2.13861 debye
