program: Orca
programVersion: 5.0.2
elementType: O O O C C C C C C C C C C C C C C C C C C C C C C H H H H H H H H H H H H H H H H H H H H H H H H H H
charge: 0
multiplicity: 1
keywords: wb97x-d3
keywords: def2-TZVPP
keywords: def2/J RIJCOSX
keywords: DEFGRID2
keywords: scfconv7
keywords: smallprint printgap noloewdin
keywords: NOSOSCF
formula: C22H26O3
InChI: InChI=1/C22H26O3/c1-15(2)10-19-20(22(19,3)4)21(23)25-14-17-12-18(24-13-17)11-16-8-6-5-7-9-16/h5-10,12-13,19-20H,11,14H2,1-4H3
51 atoms
O  -1.471077 1.745372 0.26304
O  -2.121364 0.232306 -1.251233
O  2.247265 -0.035682 -1.368987
C  -4.589825 -0.033775 0.65841
C  -3.634833 -1.158513 0.914436
C  -3.121835 0.25885 0.922647
C  -5.178597 0.124575 -0.721842
C  -5.540616 0.367463 1.759967
C  -3.650214 -1.940644 2.17787
C  -2.20666 0.70949 -0.149112
C  -4.473604 -2.959219 2.428075
C  -4.417447 -3.712568 3.722151
C  -5.50531 -3.435647 1.451591
C  -0.506532 2.26426 -0.657559
C  0.727746 1.436441 -0.707685
C  1.80614 1.419213 0.233572
C  1.058853 0.524541 -1.650997
C  2.699129 0.509123 -0.21979
C  4.021597 0.047382 0.279138
C  5.162846 0.461376 -0.618578
C  5.537159 -0.328659 -1.699661
C  5.842742 1.65295 -0.394296
C  6.569788 0.063158 -2.537951
C  6.877965 2.046816 -1.228328
C  7.244808 1.251758 -2.303843
H  -3.35205 -1.715211 0.024419
H  -2.914248 0.691117 1.895842
H  -4.51207 -0.218384 -1.508822
H  -6.103728 -0.451896 -0.790088
H  -5.429546 1.16786 -0.923858
H  -6.426009 -0.271569 1.752426
H  -5.092275 0.286728 2.749264
H  -5.872744 1.398117 1.62338
H  -2.926079 -1.662277 2.938225
H  -3.648637 -3.323889 4.388928
H  -4.210466 -4.77227 3.553551
H  -5.375015 -3.662272 4.246687
H  -5.544638 -2.829821 0.548436
H  -6.500092 -3.428823 1.904059
H  -5.309012 -4.468789 1.153472
H  -0.282433 3.263267 -0.284431
H  -0.944492 2.366661 -1.651557
H  1.899707 2.013709 1.128397
H  0.548561 0.176536 -2.533797
H  4.016033 -1.040812 0.392411
H  4.163838 0.459431 1.279506
H  5.016763 -1.259724 -1.888236
H  5.559581 2.281087 0.442296
H  6.849823 -0.563606 -3.374561
H  7.400574 2.974883 -1.036474
H  8.053496 1.556096 -2.955112
totalener: -1079.73222043 hartree
nucrepener: 2029.87516479 hartree
electener: -3109.60738522 hartree
oneelecener: -5498.22427037 hartree
twoeener: 2388.61688515 hartree
kineticenergy: 1074.91666913 hartree
xcener: -106.466407855101 hartree
chargesum: -0.0000000
charge: -0.265893 -0.405349 -0.254672 0.073300 -0.029405 -0.096106 -0.268926 -0.244142 -0.183394 0.368744 -0.028764 -0.210997 -0.238959 0.058136 -0.080219 -0.281743 0.016124 0.223568 -0.136305 0.099553 -0.157089 -0.169504 -0.124104 -0.118920 -0.135771 0.107588 0.077689 0.105231 0.080437 0.087851 0.085052 0.081689 0.094785 0.089543 0.078997 0.085866 0.083753 0.082070 0.085304 0.097529 0.103610 0.108708 0.123910 0.145394 0.107574 0.094996 0.109500 0.103527 0.123394 0.122900 0.123938
qa: -0.2659 -0.4053 -0.2547 0.0733 -0.0294 -0.0961 -0.2689 -0.2441 -0.1834 0.3687 -0.0288 -0.2110 -0.2390 0.0581 -0.0802 -0.2817 0.0161 0.2236 -0.1363 0.0996 -0.1571 -0.1695 -0.1241 -0.1189 -0.1358 0.1076 0.0777 0.1052 0.0804 0.0879 0.0851 0.0817 0.0948 0.0895 0.0790 0.0859 0.0838 0.0821 0.0853 0.0975 0.1036 0.1087 0.1239 0.1454 0.1076 0.0950 0.1095 0.1035 0.1234 0.1229 0.1239
va: 2.1327 2.0959 2.3164 3.7196 3.8200 3.8710 3.9024 3.9093 3.8509 4.2188 3.7387 3.9394 3.9367 3.8825 3.6801 4.0521 3.9737 3.6247 3.8886 3.6034 4.0126 4.0059 3.9561 3.9593 3.9639 1.0261 1.0357 1.0227 1.0019 1.0030 1.0026 1.0073 1.0055 1.0130 1.0106 0.9980 0.9988 1.0116 0.9997 1.0025 0.9925 1.0114 1.0173 1.0131 1.0042 1.0122 1.0166 1.0119 1.0003 1.0003 0.9999
dispcorr: -0.022451061 hartree
energy: -1079.754671489121
dipole: -29.33333 29.16078 -0.17255 -11.38895 11.51180 0.12285 12.56454 -11.89757 0.66697
magnitude: 0.69979 au
magnitude: 1.77873 debye
