program: Orca
programVersion: 5.0.2
elementType: O O O C C C C C C C C C C C C C C C C C C C C C C H H H H H H H H H H H H H H H H H H H H H H H H H H
charge: 0
multiplicity: 1
keywords: wb97x-d3
keywords: def2-TZVPP
keywords: def2/J RIJCOSX
keywords: DEFGRID2
keywords: scfconv7
keywords: smallprint printgap noloewdin
keywords: NOSOSCF
formula: C22H26O3
InChI: InChI=1/C22H26O3/c1-15(2)10-19-20(22(19,3)4)21(23)25-14-17-12-18(24-13-17)11-16-8-6-5-7-9-16/h5-10,12-13,19-20H,11,14H2,1-4H3
51 atoms
O  -1.927078 2.27624 0.79413
O  -1.918953 1.715257 -1.371656
O  2.325118 2.103276 0.99365
C  -3.591129 -0.770099 -0.508876
C  -2.14426 -1.111478 -0.385962
C  -2.67975 0.151045 0.273371
C  -4.143891 -0.365841 -1.853838
C  -4.582645 -1.538651 0.333364
C  -1.656442 -2.24849 0.435052
C  -2.164584 1.441464 -0.224718
C  -0.617996 -2.219608 1.27302
C  -0.206975 -3.443704 2.034218
C  0.217024 -1.004627 1.535683
C  -1.064886 3.390648 0.534285
C  0.342416 2.918004 0.418056
C  1.016698 2.453323 -0.755367
C  1.196492 2.678548 1.441874
C  2.208289 1.96171 -0.344636
C  3.280184 1.21686 -1.054907
C  3.127169 -0.276506 -0.870038
C  3.993793 -0.994333 -0.056985
C  2.078189 -0.949684 -1.490304
C  3.822207 -2.360019 0.129496
C  1.902802 -2.310692 -1.307656
C  2.777253 -3.021672 -0.496069
H  -1.564185 -0.90912 -1.284173
H  -2.786833 0.102063 1.35065
H  -3.411994 0.140204 -2.47663
H  -4.487308 -1.253603 -2.388307
H  -5.001266 0.29954 -1.737968
H  -4.178416 -1.808284 1.309005
H  -5.484603 -0.946946 0.49808
H  -4.88089 -2.461818 -0.167726
H  -2.187044 -3.18884 0.309168
H  -0.218688 -3.257953 3.11128
H  0.816816 -3.729263 1.779691
H  -0.857265 -4.294358 1.83307
H  1.277394 -1.241216 1.427058
H  0.076202 -0.655973 2.562542
H  -0.001055 -0.175194 0.86842
H  -1.191878 4.046805 1.394482
H  -1.382402 3.932563 -0.357345
H  0.639056 2.466029 -1.764022
H  1.130045 2.856874 2.503253
H  4.265773 1.540551 -0.711808
H  3.221989 1.467652 -2.115969
H  4.810411 -0.482819 0.438269
H  1.381525 -0.398077 -2.111087
H  4.507437 -2.905827 0.765041
H  1.076713 -2.817155 -1.788649
H  2.642234 -4.085946 -0.353373
totalener: -1079.72942746 hartree
nucrepener: 2275.77583997 hartree
electener: -3355.50526742 hartree
oneelecener: -5990.04949283 hartree
twoeener: 2634.54422541 hartree
kineticenergy: 1074.92122085 hartree
xcener: -106.471883145279 hartree
chargesum: 0.0000000
charge: -0.262750 -0.401989 -0.244077 0.149411 -0.024639 -0.100921 -0.260769 -0.272155 -0.253747 0.333414 0.001236 -0.213076 -0.177364 0.055243 -0.075320 -0.238858 -0.036985 0.207151 -0.128811 0.076295 -0.148164 -0.171729 -0.095195 -0.090058 -0.195664 0.092628 0.088212 0.100247 0.079967 0.083842 0.086034 0.091259 0.088282 0.091802 0.088001 0.083501 0.078128 0.092016 0.101981 0.034700 0.102094 0.110982 0.142446 0.133625 0.094586 0.113213 0.105479 0.110821 0.123452 0.121262 0.130959
qa: -0.2627 -0.4020 -0.2441 0.1494 -0.0246 -0.1009 -0.2608 -0.2722 -0.2537 0.3334 0.0012 -0.2131 -0.1774 0.0552 -0.0753 -0.2389 -0.0370 0.2072 -0.1288 0.0763 -0.1482 -0.1717 -0.0952 -0.0901 -0.1957 0.0926 0.0882 0.1002 0.0800 0.0838 0.0860 0.0913 0.0883 0.0918 0.0880 0.0835 0.0781 0.0920 0.1020 0.0347 0.1021 0.1110 0.1424 0.1336 0.0946 0.1132 0.1055 0.1108 0.1235 0.1213 0.1310
va: 2.1169 2.0892 2.2973 3.7313 3.8234 3.8427 3.8944 3.9073 3.8408 4.1992 3.7660 3.9363 3.9128 3.8985 3.7064 3.9843 3.9594 3.6189 3.8808 3.6052 4.0020 3.9356 3.9129 3.8754 3.9319 1.0254 1.0318 1.0246 1.0014 1.0028 1.0054 1.0062 1.0023 1.0112 1.0005 1.0015 1.0096 0.9991 1.0085 1.0240 0.9957 1.0073 1.0226 1.0073 1.0170 1.0062 1.0127 1.0140 1.0007 1.0042 0.9992
dispcorr: -0.030876189 hartree
energy: -1079.760303644837
dipole: -11.16411 11.37153 0.20742 -16.76635 16.54035 -0.22600 2.84501 -2.32700 0.51801
magnitude: 0.60203 au
magnitude: 1.53023 debye
