program: Orca
programVersion: 5.0.2
elementType: O O O C C C C C C C C C C C C C C C C C C C C C C H H H H H H H H H H H H H H H H H H H H H H H H H H
charge: 0
multiplicity: 1
keywords: wb97x-d3
keywords: def2-TZVPP
keywords: def2/J RIJCOSX
keywords: DEFGRID2
keywords: scfconv7
keywords: smallprint printgap noloewdin
keywords: NOSOSCF
formula: C22H26O3
InChI: InChI=1/C22H26O3/c1-15(2)10-19-20(22(19,3)4)21(23)25-14-17-12-18(24-13-17)11-16-8-6-5-7-9-16/h5-10,12-13,19-20H,11,14H2,1-4H3
51 atoms
O  -1.754579 1.783022 0.094425
O  -2.07055 0.172229 -1.426727
O  2.607604 1.128408 0.443206
C  -4.765712 -0.241386 0.117414
C  -3.765476 -1.252625 0.567517
C  -3.388034 0.213371 0.570215
C  -5.15891 -0.192655 -1.338387
C  -5.896268 0.12033 1.052359
C  -3.935233 -1.999804 1.83925
C  -2.357014 0.689077 -0.376421
C  -3.006392 -2.194396 2.776731
C  -3.315187 -2.979447 4.016097
C  -1.604899 -1.672101 2.689995
C  -0.66631 2.323293 -0.662238
C  0.61075 1.606799 -0.399078
C  1.058627 0.355952 -0.934946
C  1.600426 2.017257 0.428796
C  2.273739 0.119072 -0.389267
C  3.260697 -0.979503 -0.559561
C  4.523376 -0.521835 -1.249389
C  5.653989 -0.180414 -0.517753
C  4.562711 -0.408741 -2.635085
C  6.80365 0.261446 -1.156728
C  5.709525 0.029508 -3.277405
C  6.834766 0.366777 -2.538564
H  -3.306734 -1.81465 -0.243217
H  -3.363361 0.699928 1.538544
H  -5.470462 0.813134 -1.626938
H  -4.355909 -0.499209 -2.003649
H  -6.006651 -0.859255 -1.508606
H  -5.596401 0.087843 2.099715
H  -6.263154 1.12597 0.84099
H  -6.734227 -0.568776 0.927335
H  -4.914131 -2.446471 1.99352
H  -2.654913 -3.845119 4.108354
H  -4.343346 -3.338928 4.028102
H  -3.160372 -2.373702 4.912475
H  -0.888765 -2.491282 2.790747
H  -1.395028 -0.978183 3.507976
H  -1.390316 -1.162374 1.754232
H  -0.591056 3.360332 -0.336146
H  -0.905231 2.320351 -1.726806
H  0.532012 -0.271428 -1.634262
H  1.716359 2.892561 1.047998
H  2.781115 -1.769528 -1.140094
H  3.505806 -1.416709 0.412779
H  5.636725 -0.259725 0.562498
H  3.685036 -0.665755 -3.216526
H  7.676482 0.523994 -0.57329
H  5.72598 0.106893 -4.35667
H  7.731171 0.709169 -3.038578
totalener: -1079.73219769 hartree
nucrepener: 2078.17021984 hartree
electener: -3157.90241753 hartree
oneelecener: -5594.74912665 hartree
twoeener: 2436.84670912 hartree
kineticenergy: 1074.91158615 hartree
xcener: -106.466111917605 hartree
chargesum: -0.0000000
charge: -0.258369 -0.409260 -0.251930 0.120272 -0.005848 -0.130199 -0.260911 -0.267946 -0.243010 0.361907 -0.008889 -0.212116 -0.215482 0.050350 -0.063158 -0.277743 -0.033822 0.230153 -0.133752 0.091305 -0.151953 -0.168337 -0.124722 -0.124063 -0.133726 0.102586 0.093257 0.084040 0.101389 0.082159 0.085627 0.091684 0.088020 0.092356 0.086988 0.078213 0.084269 0.088617 0.086560 0.086566 0.097910 0.111971 0.148961 0.134763 0.106623 0.101464 0.106227 0.109753 0.122911 0.124102 0.124232
qa: -0.2584 -0.4093 -0.2519 0.1203 -0.0058 -0.1302 -0.2609 -0.2679 -0.2430 0.3619 -0.0089 -0.2121 -0.2155 0.0503 -0.0632 -0.2777 -0.0338 0.2302 -0.1338 0.0913 -0.1520 -0.1683 -0.1247 -0.1241 -0.1337 0.1026 0.0933 0.0840 0.1014 0.0822 0.0856 0.0917 0.0880 0.0924 0.0870 0.0782 0.0843 0.0886 0.0866 0.0866 0.0979 0.1120 0.1490 0.1348 0.1066 0.1015 0.1062 0.1098 0.1229 0.1241 0.1242
va: 2.1225 2.0840 2.3145 3.7287 3.8051 3.8487 3.9037 3.9089 3.8924 4.1669 3.7531 3.9400 3.9403 3.8961 3.7199 4.0219 3.9994 3.6113 3.8794 3.6099 4.0099 4.0055 3.9586 3.9638 3.9607 1.0270 1.0286 1.0019 1.0224 1.0020 1.0059 1.0061 1.0026 1.0108 0.9989 1.0101 0.9994 1.0024 1.0017 1.0114 0.9975 1.0075 1.0239 1.0068 1.0094 1.0075 1.0135 1.0113 1.0006 1.0003 0.9999
dispcorr: -0.023047884 hartree
energy: -1079.755245569525
dipole: -22.31722 22.23750 -0.07972 -10.08605 10.20132 0.11527 10.62078 -10.06864 0.55214
magnitude: 0.56965 au
magnitude: 1.44795 debye
