program: Orca
programVersion: 5.0.2
elementType: O O O C C C C C C C C C C C C C C C C C C C C C C H H H H H H H H H H H H H H H H H H H H H H H H H H
charge: 0
multiplicity: 1
keywords: wb97x-d3
keywords: def2-TZVPP
keywords: def2/J RIJCOSX
keywords: DEFGRID2
keywords: scfconv7
keywords: smallprint printgap noloewdin
keywords: NOSOSCF
formula: C22H26O3
InChI: InChI=1/C22H26O3/c1-15(2)10-19-20(22(19,3)4)21(23)25-14-17-12-18(24-13-17)11-16-8-6-5-7-9-16/h5-10,12-13,19-20H,11,14H2,1-4H3
51 atoms
O  -1.286713 1.592172 0.753932
O  -2.606699 1.511281 -1.051192
O  1.495371 1.081083 -2.625793
C  -4.539152 0.064044 0.976388
C  -3.897513 -0.920868 0.058433
C  -3.028712 0.066083 0.80719
C  -5.377759 1.174046 0.391827
C  -5.031366 -0.410431 2.32315
C  -3.833587 -2.370663 0.375135
C  -2.319425 1.119647 0.051417
C  -2.776972 -3.160579 0.178295
C  -2.823052 -4.619806 0.518167
C  -1.475351 -2.680485 -0.388526
C  -0.446515 2.551421 0.106472
C  0.533358 1.900071 -0.803854
C  1.784914 1.305208 -0.444558
C  0.41779 1.723975 -2.140841
C  2.325521 0.828612 -1.58981
C  3.597131 0.115043 -1.892859
C  4.471605 0.02362 -0.672398
C  4.455547 -1.108805 0.13323
C  5.282978 1.092911 -0.306641
C  5.235799 -1.175545 1.278885
C  6.064157 1.030877 0.836667
C  6.042541 -0.105294 1.633425
H  -4.007713 -0.681944 -0.997014
H  -2.475395 -0.3256 1.65309
H  -5.354389 2.059332 1.029831
H  -5.052942 1.469083 -0.602427
H  -6.417453 0.850015 0.319826
H  -4.40385 -1.197346 2.741483
H  -5.0508 0.414916 3.036783
H  -6.047624 -0.802922 2.246135
H  -4.740914 -2.816818 0.773586
H  -3.781841 -4.911951 0.944876
H  -2.041604 -4.880286 1.236474
H  -2.647984 -5.235064 -0.36786
H  -1.18842 -3.286246 -1.251436
H  -0.670404 -2.784718 0.343758
H  -1.501331 -1.642241 -0.709885
H  0.068859 3.06135 0.9197
H  -1.047536 3.288635 -0.427451
H  2.222908 1.247707 0.538807
H  -0.356264 1.986462 -2.842993
H  4.128023 0.633782 -2.697284
H  3.380199 -0.887997 -2.273894
H  3.824292 -1.947008 -0.136878
H  5.299394 1.984768 -0.921854
H  5.213344 -2.065694 1.893867
H  6.691834 1.870194 1.106217
H  6.652838 -0.155808 2.525487
totalener: -1079.73290077 hartree
nucrepener: 2098.17773367 hartree
electener: -3177.91063443 hartree
oneelecener: -5634.70711499 hartree
twoeener: 2456.79648055 hartree
kineticenergy: 1074.91080067 hartree
xcener: -106.467161715110 hartree
chargesum: 0.0000000
charge: -0.260073 -0.403224 -0.255591 0.122680 -0.012865 -0.113421 -0.260648 -0.271867 -0.244400 0.342391 -0.004956 -0.212304 -0.219031 0.061587 -0.089667 -0.244349 0.004462 0.165845 -0.053193 0.017758 -0.146783 -0.160709 -0.125632 -0.121156 -0.126769 0.104007 0.088385 0.085564 0.100234 0.082276 0.085533 0.091490 0.088655 0.092082 0.078689 0.083097 0.086759 0.088358 0.086624 0.085887 0.102275 0.111064 0.137186 0.150355 0.096836 0.089600 0.109195 0.111678 0.124368 0.125777 0.125941
qa: -0.2601 -0.4032 -0.2556 0.1227 -0.0129 -0.1134 -0.2606 -0.2719 -0.2444 0.3424 -0.0050 -0.2123 -0.2190 0.0616 -0.0897 -0.2443 0.0045 0.1658 -0.0532 0.0178 -0.1468 -0.1607 -0.1256 -0.1212 -0.1268 0.1040 0.0884 0.0856 0.1002 0.0823 0.0855 0.0915 0.0887 0.0921 0.0787 0.0831 0.0868 0.0884 0.0866 0.0859 0.1023 0.1111 0.1372 0.1504 0.0968 0.0896 0.1092 0.1117 0.1244 0.1258 0.1259
va: 2.1242 2.0924 2.3036 3.7335 3.8127 3.8294 3.9043 3.9094 3.8993 4.2032 3.7424 3.9417 3.9452 3.8655 3.6957 4.0074 3.9671 3.6943 3.8588 3.6757 3.9754 3.9839 3.9628 3.9561 3.9535 1.0280 1.0308 1.0016 1.0212 1.0024 1.0053 1.0061 1.0019 1.0105 1.0098 0.9991 0.9988 1.0021 1.0013 1.0133 0.9937 1.0121 1.0088 1.0134 1.0069 1.0074 1.0114 1.0107 1.0007 1.0001 0.9997
dispcorr: -0.023295858 hartree
energy: -1079.756196623689
dipole: -18.01455 18.44146 0.42691 -14.45659 14.13991 -0.31668 9.08719 -8.45858 0.62861
magnitude: 0.82322 au
magnitude: 2.09245 debye
