program: Orca
programVersion: 5.0.2
elementType: O O O C C C C C C C C C C C C C C C C C C C C C C H H H H H H H H H H H H H H H H H H H H H H H H H H
charge: 0
multiplicity: 1
keywords: wb97x-d3
keywords: def2-TZVPP
keywords: def2/J RIJCOSX
keywords: DEFGRID2
keywords: scfconv7
keywords: smallprint printgap noloewdin
keywords: NOSOSCF
formula: C22H26O3
InChI: InChI=1/C22H26O3/c1-15(2)10-19-20(22(19,3)4)21(23)25-14-17-12-18(24-13-17)11-16-8-6-5-7-9-16/h5-10,12-13,19-20H,11,14H2,1-4H3
51 atoms
O  -1.767037 1.876805 0.213037
O  -2.09047 0.426697 -1.46082
O  2.565698 1.111543 0.641462
C  -4.77893 -0.172318 0.030762
C  -3.756837 -1.188512 0.411113
C  -3.417484 0.284889 0.524631
C  -5.165584 -0.02615 -1.420616
C  -5.924314 0.092824 0.979883
C  -3.891162 -2.026711 1.629766
C  -2.380728 0.843205 -0.367729
C  -2.912399 -2.316628 2.488496
C  -3.160639 -3.18823 3.682285
C  -1.507995 -1.811771 2.351957
C  -0.648618 2.45465 -0.468036
C  0.602833 1.690577 -0.217871
C  1.018894 0.446907 -0.794679
C  1.58862 2.033623 0.644152
C  2.213747 0.146962 -0.235105
C  3.167448 -0.97523 -0.434268
C  4.454611 -0.526806 -1.083746
C  4.50039 -0.286683 -2.453165
C  5.60103 -0.31633 -0.32878
C  5.669478 0.147499 -3.056312
C  6.773503 0.121422 -0.928421
C  6.811024 0.353906 -2.294243
H  -3.278456 -1.67542 -0.435964
H  -3.407821 0.693199 1.528616
H  -5.493565 0.99207 -1.636998
H  -4.353989 -0.268165 -2.100677
H  -5.999937 -0.693109 -1.643878
H  -5.629063 0.002205 2.025211
H  -6.319903 1.098814 0.831645
H  -6.740625 -0.611043 0.80439
H  -4.873341 -2.455839 1.809373
H  -4.200286 -3.505991 3.749997
H  -2.9069 -2.666395 4.608546
H  -2.536454 -4.084787 3.650155
H  -1.327043 -1.280247 1.420847
H  -0.797396 -2.640093 2.403043
H  -1.255402 -1.13815 3.175227
H  -0.56387 3.461948 -0.061026
H  -0.854584 2.537217 -1.536195
H  0.488716 -0.135235 -1.52967
H  1.71967 2.878909 1.300835
H  2.673964 -1.725216 -1.055118
H  3.38295 -1.459557 0.522514
H  3.609596 -0.436924 -3.051897
H  5.578054 -0.49451 0.739545
H  5.690113 0.325673 -4.123545
H  7.658513 0.280969 -0.3264
H  7.724756 0.693158 -2.764134
totalener: -1079.73208900 hartree
nucrepener: 2087.27208324 hartree
electener: -3167.00417224 hartree
oneelecener: -5612.93304628 hartree
twoeener: 2445.92887404 hartree
kineticenergy: 1074.91629172 hartree
xcener: -106.466928786816 hartree
chargesum: -0.0000000
charge: -0.258524 -0.408902 -0.251618 0.130682 -0.016685 -0.123239 -0.259340 -0.271312 -0.240391 0.357427 -0.009753 -0.212621 -0.207125 0.055908 -0.056477 -0.298085 -0.035214 0.239697 -0.131733 0.086135 -0.166537 -0.149964 -0.124880 -0.124708 -0.132950 0.102927 0.089250 0.084146 0.101073 0.081621 0.085594 0.091354 0.088689 0.092688 0.078543 0.084195 0.087048 0.077633 0.086808 0.088925 0.096097 0.112316 0.151283 0.134712 0.108959 0.099432 0.110721 0.105170 0.123992 0.122698 0.124339
qa: -0.2585 -0.4089 -0.2516 0.1307 -0.0167 -0.1232 -0.2593 -0.2713 -0.2404 0.3574 -0.0098 -0.2126 -0.2071 0.0559 -0.0565 -0.2981 -0.0352 0.2397 -0.1317 0.0861 -0.1665 -0.1500 -0.1249 -0.1247 -0.1329 0.1029 0.0892 0.0841 0.1011 0.0816 0.0856 0.0914 0.0887 0.0927 0.0785 0.0842 0.0870 0.0776 0.0868 0.0889 0.0961 0.1123 0.1513 0.1347 0.1090 0.0994 0.1107 0.1052 0.1240 0.1227 0.1243
va: 2.1227 2.0826 2.3149 3.7209 3.8210 3.8387 3.9028 3.9109 3.8914 4.1741 3.7530 3.9416 3.9442 3.8928 3.7197 4.0108 4.0012 3.5968 3.8771 3.6176 4.0028 4.0087 3.9656 3.9599 3.9603 1.0273 1.0309 1.0021 1.0226 1.0019 1.0053 1.0063 1.0020 1.0104 1.0098 0.9991 0.9988 1.0130 1.0030 1.0019 0.9974 1.0082 1.0233 1.0070 1.0085 1.0089 1.0113 1.0131 1.0003 1.0007 0.9998
dispcorr: -0.023337690 hartree
energy: -1079.755426686975
dipole: -21.78824 21.72818 -0.06006 -10.88572 10.93389 0.04817 9.04010 -8.46837 0.57173
magnitude: 0.57689 au
magnitude: 1.46633 debye
