program: Orca
programVersion: 5.0.2
elementType: O O O C C C C C C C C C C C C C C C C C C C C C C H H H H H H H H H H H H H H H H H H H H H H H H H H
charge: 0
multiplicity: 1
keywords: wb97x-d3
keywords: def2-TZVPP
keywords: def2/J RIJCOSX
keywords: DEFGRID2
keywords: scfconv7
keywords: smallprint printgap noloewdin
keywords: NOSOSCF
formula: C22H26O3
InChI: InChI=1/C22H26O3/c1-15(2)10-19-20(22(19,3)4)21(23)25-14-17-12-18(24-13-17)11-16-8-6-5-7-9-16/h5-10,12-13,19-20H,11,14H2,1-4H3
51 atoms
O  -1.132588 1.380779 1.465685
O  -0.956906 -0.850358 1.420868
O  2.51813 2.184224 -0.984613
C  -3.547071 -0.529557 -0.332764
C  -3.883245 -1.056403 1.031121
C  -3.042052 0.194169 0.901966
C  -2.596826 -1.3248 -1.195469
C  -4.604942 0.187177 -1.136946
C  -5.235518 -0.968339 1.613567
C  -1.614547 0.150019 1.286168
C  -5.922857 -1.956276 2.191562
C  -7.288655 -1.709291 2.760551
C  -5.437672 -3.367038 2.332958
C  0.252397 1.509618 1.804826
C  1.134788 1.489545 0.607352
C  1.483291 0.379702 -0.228625
C  1.796029 2.550439 0.087824
C  2.321535 0.862009 -1.1749
C  3.053949 0.216041 -2.295031
C  4.543436 0.156827 -2.051797
C  5.407604 1.047253 -2.675356
C  5.070112 -0.781958 -1.170435
C  6.772871 0.999071 -2.429893
C  6.432155 -0.834717 -0.923721
C  7.288876 0.057436 -1.55362
H  -3.3069 -1.930036 1.314862
H  -3.533451 1.138349 1.111113
H  -2.034916 -0.668122 -1.862845
H  -1.882321 -1.904336 -0.616507
H  -3.163049 -2.020384 -1.817528
H  -5.248777 0.820985 -0.528789
H  -4.141325 0.822418 -1.89355
H  -5.244846 -0.531936 -1.651356
H  -5.709701 0.008028 1.572036
H  -8.035496 -2.352303 2.288281
H  -7.607293 -0.675643 2.631616
H  -7.314796 -1.93657 3.829335
H  -6.119216 -4.056663 1.828737
H  -5.417349 -3.665411 3.383904
H  -4.444219 -3.533111 1.92353
H  0.539675 0.732446 2.514797
H  0.3286 2.4725 2.30954
H  1.149913 -0.639006 -0.124216
H  1.844909 3.588828 0.3748
H  2.85094 0.743497 -3.23138
H  2.653724 -0.792415 -2.416226
H  5.010744 1.787484 -3.359582
H  4.405125 -1.476114 -0.669832
H  7.433232 1.699723 -2.924145
H  6.826815 -1.573978 -0.238974
H  8.353074 0.016627 -1.362365
totalener: -1079.73364021 hartree
nucrepener: 2040.26390562 hartree
electener: -3119.99754583 hartree
oneelecener: -5518.85567558 hartree
twoeener: 2398.85812975 hartree
kineticenergy: 1074.90902390 hartree
xcener: -106.466630999370 hartree
chargesum: 0.0000000
charge: -0.258047 -0.407500 -0.251903 0.096326 0.042254 -0.096845 -0.266808 -0.245062 -0.186717 0.365205 -0.051803 -0.204164 -0.236044 0.053417 -0.062001 -0.277150 -0.035644 0.231798 -0.136863 0.082119 -0.149963 -0.163418 -0.124972 -0.125920 -0.132521 0.088677 0.070859 0.087693 0.094960 0.086791 0.069483 0.092178 0.091984 0.070737 0.083285 0.076336 0.084505 0.084787 0.085868 0.083122 0.114768 0.092772 0.152221 0.134546 0.099074 0.109716 0.105163 0.111660 0.122994 0.124016 0.124030
qa: -0.2580 -0.4075 -0.2519 0.0963 0.0423 -0.0968 -0.2668 -0.2451 -0.1867 0.3652 -0.0518 -0.2042 -0.2360 0.0534 -0.0620 -0.2771 -0.0356 0.2318 -0.1369 0.0821 -0.1500 -0.1634 -0.1250 -0.1259 -0.1325 0.0887 0.0709 0.0877 0.0950 0.0868 0.0695 0.0922 0.0920 0.0707 0.0833 0.0763 0.0845 0.0848 0.0859 0.0831 0.1148 0.0928 0.1522 0.1345 0.0991 0.1097 0.1052 0.1117 0.1230 0.1240 0.1240
va: 2.1361 2.0918 2.3146 3.7356 3.7785 3.8935 3.9144 3.9116 3.8995 4.2144 3.8253 3.9351 3.9462 3.9047 3.7346 4.0199 4.0012 3.6072 3.8814 3.6206 4.0101 4.0004 3.9597 3.9687 3.9598 1.0359 1.0381 1.0026 1.0210 1.0026 1.0113 1.0038 1.0040 1.0214 0.9984 1.0122 0.9982 0.9992 0.9992 1.0158 1.0051 0.9980 1.0213 1.0071 1.0098 1.0078 1.0128 1.0111 1.0006 1.0005 1.0000
dispcorr: -0.022018929 hartree
energy: -1079.755659136145
dipole: -30.08155 29.67582 -0.40573 -12.77977 12.99318 0.21341 2.10725 -2.23794 -0.13069
magnitude: 0.47670 au
magnitude: 1.21167 debye
