program: Orca
programVersion: 5.0.2
elementType: O O O C C C C C C C C C C C C C C C C C C C C C C H H H H H H H H H H H H H H H H H H H H H H H H H H
charge: 0
multiplicity: 1
keywords: wb97x-d3
keywords: def2-TZVPP
keywords: def2/J RIJCOSX
keywords: DEFGRID2
keywords: scfconv7
keywords: smallprint printgap noloewdin
keywords: NOSOSCF
formula: C22H26O3
InChI: InChI=1/C22H26O3/c1-15(2)10-19-20(22(19,3)4)21(23)25-14-17-12-18(24-13-17)11-16-8-6-5-7-9-16/h5-10,12-13,19-20H,11,14H2,1-4H3
51 atoms
O  -1.054467 1.195161 1.608082
O  -0.961546 -1.029936 1.381425
O  2.545851 2.065576 -0.853658
C  -3.545513 -0.489856 -0.321791
C  -3.904173 -1.08314 1.008273
C  -3.005755 0.13348 0.952406
C  -2.633147 -1.273984 -1.234244
C  -4.566273 0.326562 -1.078044
C  -5.250069 -0.970886 1.599338
C  -1.581164 0.002062 1.32851
C  -5.950494 -1.943151 2.188059
C  -7.312935 -1.671505 2.754299
C  -5.485533 -3.358909 2.345577
C  0.336562 1.247684 1.942419
C  1.204551 1.287329 0.735035
C  1.543562 0.219447 -0.157334
C  1.846271 2.376404 0.250595
C  2.355695 0.751595 -1.099638
C  3.055181 0.168776 -2.274143
C  4.556543 0.170079 -2.115466
C  5.332793 1.1724 -2.682727
C  5.18405 -0.82311 -1.371475
C  6.710164 1.180972 -2.515276
C  6.559474 -0.819782 -1.203827
C  7.327365 0.184069 -1.776358
H  -3.367105 -1.997442 1.234588
H  -3.45417 1.084004 1.220356
H  -1.9529 -1.926982 -0.693567
H  -3.231223 -1.895944 -1.902831
H  -2.033583 -0.60436 -1.854346
H  -5.234811 -0.326315 -1.641934
H  -5.183653 0.946671 -0.429904
H  -4.070107 0.990207 -1.788265
H  -5.709988 0.011791 1.553199
H  -7.619755 -0.636114 2.610863
H  -7.342398 -1.884161 3.825954
H  -8.067279 -2.31183 2.290029
H  -5.477839 -3.6467 3.399585
H  -4.490277 -3.54148 1.947815
H  -6.17131 -4.044992 1.842515
H  0.601972 0.409775 2.588918
H  0.450963 2.166759 2.516768
H  1.218533 -0.805241 -0.092472
H  1.893639 3.400984 0.583733
H  2.778144 0.711694 -3.182668
H  2.691727 -0.852356 -2.403154
H  4.856944 1.954326 -3.261754
H  4.588376 -1.605837 -0.916871
H  7.301734 1.967894 -2.964271
H  7.033422 -1.602487 -0.626454
H  8.401669 0.18763 -1.647415
totalener: -1079.73361077 hartree
nucrepener: 2039.00178023 hartree
electener: -3118.73539100 hartree
oneelecener: -5516.34141885 hartree
twoeener: 2397.60602785 hartree
kineticenergy: 1074.91490218 hartree
xcener: -106.467719913694 hartree
chargesum: 0.0000000
charge: -0.258308 -0.407948 -0.252442 0.090899 0.041756 -0.088971 -0.264279 -0.249132 -0.184605 0.365857 -0.054464 -0.203202 -0.236068 0.050410 -0.063007 -0.275494 -0.034121 0.228281 -0.133746 0.090493 -0.150722 -0.168684 -0.125630 -0.123132 -0.133648 0.088617 0.071292 0.095817 0.086175 0.087140 0.091742 0.070343 0.092276 0.070390 0.076046 0.084398 0.083196 0.085280 0.083367 0.085170 0.114805 0.093955 0.150355 0.134314 0.101321 0.106509 0.105673 0.110255 0.123111 0.123989 0.124371
qa: -0.2583 -0.4079 -0.2524 0.0909 0.0418 -0.0890 -0.2643 -0.2491 -0.1846 0.3659 -0.0545 -0.2032 -0.2361 0.0504 -0.0630 -0.2755 -0.0341 0.2283 -0.1337 0.0905 -0.1507 -0.1687 -0.1256 -0.1231 -0.1336 0.0886 0.0713 0.0958 0.0862 0.0871 0.0917 0.0703 0.0923 0.0704 0.0760 0.0844 0.0832 0.0853 0.0834 0.0852 0.1148 0.0940 0.1504 0.1343 0.1013 0.1065 0.1057 0.1103 0.1231 0.1240 0.1244
va: 2.1352 2.0923 2.3157 3.7355 3.7843 3.8799 3.9142 3.9140 3.9025 4.2145 3.8301 3.9345 3.9455 3.9049 3.7266 4.0191 4.0002 3.6108 3.8805 3.6103 4.0104 4.0051 3.9597 3.9636 3.9611 1.0345 1.0375 1.0214 1.0025 1.0026 1.0038 1.0112 1.0037 1.0217 1.0122 0.9983 0.9983 0.9992 1.0164 0.9990 1.0054 0.9978 1.0221 1.0070 1.0070 1.0090 1.0137 1.0111 1.0005 1.0004 0.9999
dispcorr: -0.021941808 hartree
energy: -1079.755552575014
dipole: -30.34988 29.96350 -0.38638 -11.74332 11.98956 0.24623 1.83937 -1.94289 -0.10353
magnitude: 0.46972 au
magnitude: 1.19392 debye
