program: Orca
programVersion: 5.0.2
elementType: O O O C C C C C C C C C C C C C C C C C C C C C C H H H H H H H H H H H H H H H H H H H H H H H H H H
charge: 0
multiplicity: 1
keywords: wb97x-d3
keywords: def2-TZVPP
keywords: def2/J RIJCOSX
keywords: DEFGRID2
keywords: scfconv7
keywords: smallprint printgap noloewdin
keywords: NOSOSCF
formula: C22H26O3
InChI: InChI=1/C22H26O3/c1-15(2)10-19-20(22(19,3)4)21(23)25-14-17-12-18(24-13-17)11-16-8-6-5-7-9-16/h5-10,12-13,19-20H,11,14H2,1-4H3
51 atoms
O  -1.00285 1.613925 1.321762
O  -2.304273 1.877866 -0.479159
O  1.754089 2.010621 -2.117353
C  -4.200788 -0.045659 1.132083
C  -3.477535 -0.807797 0.062275
C  -2.691511 0.056525 1.02552
C  -5.080544 1.108998 0.718276
C  -4.731167 -0.78631 2.336764
C  -3.308622 -2.273375 0.096622
C  -2.010302 1.267775 0.51626
C  -3.602815 -3.133102 -0.881334
C  -3.36048 -4.6035 -0.712067
C  -4.187368 -2.747803 -2.206218
C  -0.182157 2.709284 0.905089
C  0.788571 2.300457 -0.143608
C  1.979139 1.523781 0.029012
C  0.709302 2.555307 -1.469463
C  2.522985 1.380036 -1.201867
C  3.743133 0.690167 -1.705247
C  4.486862 0.006532 -0.59153
C  5.551419 0.634804 0.043676
C  4.098868 -1.256251 -0.15594
C  6.219146 0.014449 1.089531
C  4.762517 -1.879508 0.889445
C  5.825735 -1.244851 1.515468
H  -3.571486 -0.367702 -0.924428
H  -2.142753 -0.465271 1.802108
H  -4.728974 1.606681 -0.181647
H  -6.092852 0.747172 0.528723
H  -5.141844 1.855612 1.512867
H  -4.870603 -0.101352 3.174863
H  -5.698666 -1.238021 2.11065
H  -4.070102 -1.583651 2.673684
H  -2.894404 -2.684829 1.012709
H  -2.67056 -4.977817 -1.472746
H  -4.28722 -5.171623 -0.827063
H  -2.941118 -4.841955 0.264735
H  -3.542849 -3.076949 -3.024438
H  -4.346757 -1.678618 -2.319233
H  -5.151594 -3.23944 -2.355091
H  0.336946 3.022645 1.810582
H  -0.797957 3.542529 0.563227
H  2.372444 1.125734 0.950394
H  -0.02114 3.077346 -2.065412
H  4.397982 1.410882 -2.204635
H  3.461741 -0.040546 -2.470373
H  5.861388 1.62033 -0.282878
H  3.266424 -1.7545 -0.638655
H  7.048708 0.515712 1.570691
H  4.45062 -2.863347 1.214757
H  6.346757 -1.731237 2.329517
totalener: -1079.73390144 hartree
nucrepener: 2068.63509235 hartree
electener: -3148.36899379 hartree
oneelecener: -5575.66139973 hartree
twoeener: 2427.29240594 hartree
kineticenergy: 1074.91258946 hartree
xcener: -106.468086384452 hartree
chargesum: 0.0000000
charge: -0.265274 -0.404138 -0.255750 0.093361 0.042410 -0.106837 -0.260737 -0.241682 -0.186395 0.366163 -0.049583 -0.204613 -0.236549 0.063427 -0.092296 -0.247309 0.011447 0.168922 -0.051198 0.016970 -0.148138 -0.160772 -0.123765 -0.120587 -0.127761 0.088056 0.068920 0.100877 0.083633 0.083431 0.090824 0.091410 0.070066 0.071319 0.084194 0.083010 0.076313 0.086063 0.083321 0.084637 0.105238 0.106985 0.136174 0.145075 0.089272 0.096460 0.108433 0.113029 0.124095 0.124789 0.125057
qa: -0.2653 -0.4041 -0.2558 0.0934 0.0424 -0.1068 -0.2607 -0.2417 -0.1864 0.3662 -0.0496 -0.2046 -0.2365 0.0634 -0.0923 -0.2473 0.0114 0.1689 -0.0512 0.0170 -0.1481 -0.1608 -0.1238 -0.1206 -0.1278 0.0881 0.0689 0.1009 0.0836 0.0834 0.0908 0.0914 0.0701 0.0713 0.0842 0.0830 0.0763 0.0861 0.0833 0.0846 0.1052 0.1070 0.1362 0.1451 0.0893 0.0965 0.1084 0.1130 0.1241 0.1248 0.1251
va: 2.1314 2.0974 2.3057 3.7307 3.7771 3.8968 3.9106 3.9151 3.9007 4.2103 3.8194 3.9359 3.9471 3.8781 3.7013 4.0111 3.9763 3.6956 3.8580 3.6730 3.9810 3.9786 3.9610 3.9539 3.9528 1.0374 1.0400 1.0227 1.0012 1.0026 1.0044 1.0044 1.0108 1.0210 0.9981 0.9983 1.0123 0.9992 1.0156 0.9994 0.9916 1.0112 1.0098 1.0134 1.0089 1.0054 1.0114 1.0106 1.0007 1.0003 0.9999
dispcorr: -0.021849275 hartree
energy: -1079.755750713246
dipole: -23.57675 23.76935 0.19260 -17.31090 16.84406 -0.46684 2.71495 -2.26593 0.44902
magnitude: 0.67576 au
magnitude: 1.71765 debye
