program: Orca
programVersion: 5.0.2
elementType: O O O C C C C C C C C C C C C C C C C C C C C C C H H H H H H H H H H H H H H H H H H H H H H H H H H
charge: 0
multiplicity: 1
keywords: wb97x-d3
keywords: def2-TZVPP
keywords: def2/J RIJCOSX
keywords: DEFGRID2
keywords: scfconv7
keywords: smallprint printgap noloewdin
keywords: NOSOSCF
formula: C22H26O3
InChI: InChI=1/C22H26O3/c1-15(2)10-19-20(22(19,3)4)21(23)25-14-17-12-18(24-13-17)11-16-8-6-5-7-9-16/h5-10,12-13,19-20H,11,14H2,1-4H3
51 atoms
O  -1.398367 2.211912 1.026685
O  -2.113917 1.530719 -0.98006
O  2.142445 2.088029 -1.588919
C  -4.064384 -0.24344 0.685615
C  -2.872118 -1.060177 0.292431
C  -2.664147 0.269115 0.97607
C  -4.9134 0.386066 -0.391542
C  -4.861976 -0.677089 1.89161
C  -2.491212 -2.311492 0.996779
C  -2.051614 1.378195 0.21293
C  -2.999463 -3.515766 0.734178
C  -2.536593 -4.737623 1.467687
C  -4.049532 -3.751442 -0.308268
C  -0.680196 3.285727 0.409727
C  0.615898 2.832403 -0.163637
C  1.859645 2.663425 0.524561
C  0.859371 2.458498 -1.441973
C  2.748839 2.209884 -0.389481
C  4.178508 1.81264 -0.305286
C  4.377116 0.32491 -0.474492
C  4.121321 -0.540501 0.583989
C  4.792107 -0.206832 -1.688511
C  4.284345 -1.908035 0.435158
C  4.954679 -1.576263 -1.842729
C  4.702064 -2.43039 -0.780946
H  -2.646778 -1.037719 -0.770773
H  -2.37181 0.231297 2.020024
H  -4.352581 0.617239 -1.292762
H  -5.721894 -0.295721 -0.663007
H  -5.372977 1.310277 -0.036154
H  -4.236204 -1.091306 2.680985
H  -5.417811 0.16488 2.307978
H  -5.583403 -1.447648 1.612394
H  -1.726918 -2.229823 1.764325
H  -1.783608 -4.502897 2.218944
H  -2.106232 -5.46965 0.779623
H  -3.370664 -5.234728 1.969251
H  -4.392486 -2.831818 -0.778579
H  -4.919922 -4.251452 0.123941
H  -3.674102 -4.41073 -1.095087
H  -0.512946 4.001961 1.213561
H  -1.296431 3.768906 -0.349668
H  2.057738 2.858983 1.566522
H  0.228978 2.39968 -2.313537
H  4.558399 2.132305 0.666927
H  4.762324 2.351928 -1.056538
H  3.788128 -0.138896 1.533835
H  4.990145 0.455232 -2.522684
H  4.08597 -2.568126 1.269416
H  5.279711 -1.975523 -2.794563
H  4.830603 -3.498267 -0.898651
totalener: -1079.73207110 hartree
nucrepener: 2087.30083217 hartree
electener: -3167.03290327 hartree
oneelecener: -5613.15718930 hartree
twoeener: 2446.12428603 hartree
kineticenergy: 1074.91736587 hartree
xcener: -106.466475756157 hartree
chargesum: -0.0000000
charge: -0.266449 -0.410046 -0.250299 0.078349 -0.036485 -0.095869 -0.268978 -0.242828 -0.179821 0.371207 -0.029141 -0.210372 -0.237687 0.064180 -0.083247 -0.282976 0.013190 0.219865 -0.139391 0.089906 -0.163582 -0.150525 -0.123815 -0.122414 -0.132640 0.109021 0.076913 0.105494 0.079781 0.088360 0.081594 0.094226 0.084827 0.088755 0.078186 0.086356 0.082924 0.081823 0.084680 0.096996 0.101305 0.110965 0.123944 0.148388 0.105233 0.100029 0.105832 0.105876 0.122499 0.122392 0.123473
qa: -0.2664 -0.4100 -0.2503 0.0783 -0.0365 -0.0959 -0.2690 -0.2428 -0.1798 0.3712 -0.0291 -0.2104 -0.2377 0.0642 -0.0832 -0.2830 0.0132 0.2199 -0.1394 0.0899 -0.1636 -0.1505 -0.1238 -0.1224 -0.1326 0.1090 0.0769 0.1055 0.0798 0.0884 0.0816 0.0942 0.0848 0.0888 0.0782 0.0864 0.0829 0.0818 0.0847 0.0970 0.1013 0.1110 0.1239 0.1484 0.1052 0.1000 0.1058 0.1059 0.1225 0.1224 0.1235
va: 2.1356 2.0877 2.3197 3.7107 3.8251 3.8882 3.9009 3.9087 3.8511 4.2088 3.7381 3.9393 3.9369 3.8670 3.6885 4.0542 3.9722 3.6303 3.8847 3.6141 4.0050 4.0124 3.9679 3.9597 3.9618 1.0255 1.0359 1.0230 1.0015 1.0030 1.0074 1.0054 1.0029 1.0131 1.0108 0.9979 0.9990 1.0110 0.9999 1.0020 0.9945 1.0104 1.0170 1.0142 1.0082 1.0094 1.0120 1.0132 1.0005 1.0007 1.0001
dispcorr: -0.022669934 hartree
energy: -1079.754741034951
dipole: -22.86023 22.85950 -0.00072 -19.92621 19.67912 -0.24708 6.71652 -6.09435 0.62217
magnitude: 0.66944 au
magnitude: 1.70158 debye
